{"text_format":"1","workbook":"xlsx","n_sheets":3,"sheets":["deutsch","français","Alterskategorie"],"not_rendered":{"charts":0,"images":1,"macros":1,"external_links":0,"defined_names":2,"comments":2,"pivot_tables":0},"unopened":[],"bounds":{"document_bytes":16777216,"sheet_cells":100000,"rows_first":2000,"rows_last":500,"rows_between":2000,"halvings":0,"cell_chars":16384,"cell_head_chars":4096},"cells_cut":0,"cells_raw":0,"read":"whole","date_system":"1900"}

{"sheet":"deutsch","index":0,"n_rows":67,"n_cols":28,"rows_kept":67,"cut":false,"hidden":false,"merged":[[65,4,65,8],[66,4,66,8],[10,8,10,12],[11,8,11,12],[12,8,12,12],[13,8,13,12],[10,2,10,4],[11,2,11,4],[12,2,12,4],[16,8,16,10],[16,11,16,12],[17,8,17,10],[17,11,17,12],[6,8,6,12],[5,0,5,12],[6,3,6,4],[7,2,7,4],[8,2,8,4],[7,8,7,12],[8,8,8,12],[15,0,15,1],[13,2,13,4],[9,2,9,4],[15,8,15,10],[15,11,15,12],[9,8,9,12],[9,0,9,1],[10,0,10,1],[22,22,22,25],[18,8,18,10],[18,11,18,12],[19,8,19,10],[19,11,19,12],[20,8,20,10],[20,11,20,12]]}
[null,null,"SCHWEIZER SCHIESSSPORTVERBAND",null,null,null,null,null,null,"Rolf Binz"]
[null,null,"FÉDÉRATION SPORTIVE SUISSE DE TIR",null,null,null,null,null,null,"Huntelweg 8"]
[null,null,"FEDERAZIONE SPORTIVA SVIZZERA DI TIRO",null,null,null,null,null,null,"4586 Buchegg"]
[null,null,null,null,null,null,null,null,null,"032 661 17 09"]
[null,null,"V2025_08",null,null,null,null,null,null,"binz-wirth@gawnet.ch"]
["__________________________________________________________________________________________________"]
["Vereinswettschiessen",null,null,2025,null,null,null,null,"Gewehr 50 Meter"]
["Verein:",null,"Vereinsname:",null,null,null,null,null,"Sportschützen XY"]
[null,null,"Vereinsnummer:",null,null,null,null,null,"1.02.XXXX"]
["Korrespondenz Adresse:",null,"Name, Vorname:",null,null,null,null,null,"Mustermann, Max"]
[null,null,"Strasse:",null,null,null,null,null,"Musterstrasse"]
[null,null,"PLZ, Ort:",null,null,null,null,null,"8000 Zürich"]
[null,null,"Tel:",null,null,null,null,null,"XXX XXX XX XX"]
[null,null,"E-Mail:",null,null,null,null,null,"muster@bluemail.ch"]
[]
["Lizenzierte Mitglieder:",null,null,null,null,null,null,null,"Vereinsresultat",null,null,{"$f":"ROUND((J66+K67)/D17,3)","v":0}]
["Pflichtresultate :",null,null,{"$f":"IF(D16<10,6,ROUND(0.7*D16,0))","v":6}]
["Teilnehmer:",null,"E / S",{"$f":"COUNTIF($P$24:$P$65,\"E\")+COUNTIF($P$24:$P$65,\"S\")","v":0},null,null,null,null,"Kranzkarten",null,null,{"$f":"COUNT(M24:M65)","v":0}]
[null,null,"U10-U21",{"$f":"COUNTIF($P$24:$P$65,\"U10\")+COUNTIF($P$24:$P$65,\"U13\")+COUNTIF($P$24:$P$65,\"U15\")+COUNTIF($P$24:$P$65,\"U17\")++COUNTIF($P$24:$P$65,\"U19\")++COUNTIF($P$24:$P$65,\"U21\")","v":0},null,null,null,null,"Sportschützenkarten",null,null,{"$f":"COUNT(L24:L65)","v":0}]
[null,null,"V / SV",{"$f":"COUNTIF($P$24:$P$65,\"V\")+COUNTIF($P$24:$P$65,\"SV\")","v":0},null,null,null,null,"Total Teilnehmer",null,null,{"$f":"COUNTIF(H24:H65,\">0\")","v":0}]
[null,null,null,null,null,null,null,null,"Beteiligung",null,null,{"$f":"L20/D16","v":{"$error":"#DIV/0!"}}]
[]
["Nr.","Name","Vorname","Jg.","Stlg.","P1","P2","Total","Alters-stufe","Pflicht-\nResultat","Streich-\nResultat","SPS-\nKarte","Kranz-\nKarte",null,"Alter","Alterskat.","Rang1","AnzGleich","Rang Kor.",null,"Kranz-SOLL",null,"Auszeichnungslimiten",null,null,null,null,"Stellg."]
[1,null,null,null,null,null,null,{"$f":"IF(F24>0,F24+G24,0)","v":0},{"$f":"IF(ISBLANK(O24),\"\",P24)","v":""},{"$f":"IF(S24<=$D$17,H24,\"\")","v":0},{"$f":"IF(ISBLANK(H24),\"\",IF(S24>D$17,H24,\"\"))","v":""},{"$f":"M24","v":""},{"$f":"IF(H24=\"\",\"\",IF(H24>=U24,1,\"\"))","v":""},null,{"$f":"IF(ISBLANK(D24),\"\",$D$7-D24)","v":""},{"$f":"IF(O24<>\"\",(LOOKUP(O24,Alterskategorie!$A$2:$A$111,Alterskategorie!$B$2:$B$111)),\"\")","v":""},{"$f":"IF(ISBLANK(H24),\"\",RANK(H24,H$24:H$65,0))","v":1},{"$f":"IF(ISBLANK(H24),\"\",COUNTIF(Q$24:Q24,Q24)-1)","v":0},{"$f":"IF(ISBLANK(H24),\"\",Q24+R24)","v":1},null,{"$f":"IF(D24<\"\",VLOOKUP(I24,$W$25:$Z$34,MATCH(E24,$W$24:$Z$24,)),\"\")","v":""},null,null,"LG-F","LG-A","XX",null,"LG-F"]
[{"$f":"IF(B25>\"\",A24+1,\"\")","v":""},null,null,null,null,null,null,0,"",0,"",{"$f":"M25","v":""},{"$f":"IF(H25=\"\",\"\",IF(H25>=U25,1,\"\"))","v":""},null,"",{"$f":"IF(O25<>\"\",(LOOKUP(O25,Alterskategorie!$A$2:$A$111,Alterskategorie!$B$2:$B$111)),\"\")","v":""},1,{"$f":"IF(ISBLANK(H25),\"\",COUNTIF(Q$24:Q25,Q25)-1)","v":1},2,null,{"$f":"IF(D25<\"\",VLOOKUP(I25,$W$25:$Z$34,MATCH(E25,$W$24:$Z$24,)),\"\")","v":""},null,"E",180,"ung.","ung.",null,"LG-A"]
[{"$f":"IF(B26>\"\",A25+1,\"\")","v":""},null,null,null,null,null,null,0,"",0,"","","",null,"",{"$f":"IF(O26<>\"\",(LOOKUP(O26,Alterskategorie!$A$2:$A$111,Alterskategorie!$B$2:$B$111)),\"\")","v":""},1,{"$f":"IF(ISBLANK(H26),\"\",COUNTIF(Q$24:Q26,Q26)-1)","v":2},3,null,"",null,"S",180,"ung.","ung.",null,"XX"]
["",null,null,null,null,null,null,0,"",0,"","","",null,"",{"$f":"IF(O27<>\"\",(LOOKUP(O27,Alterskategorie!$A$2:$A$111,Alterskategorie!$B$2:$B$111)),\"\")","v":""},1,{"$f":"IF(ISBLANK(H27),\"\",COUNTIF(Q$24:Q27,Q27)-1)","v":3},4,null,"",null,"SV",172,176,"ung.",null,"XX"]
["",null,null,null,null,null,null,0,"",0,"","","",null,"",{"$f":"IF(O28<>\"\",(LOOKUP(O28,Alterskategorie!$A$2:$A$111,Alterskategorie!$B$2:$B$111)),\"\")","v":""},1,{"$f":"IF(ISBLANK(H28),\"\",COUNTIF(Q$24:Q28,Q28)-1)","v":4},5,null,"",null,"U13",172,176,"ung."]
["",null,null,null,null,null,null,0,"",0,"","","",null,"",{"$f":"IF(O29<>\"\",(LOOKUP(O29,Alterskategorie!$A$2:$A$111,Alterskategorie!$B$2:$B$111)),\"\")","v":""},1,{"$f":"IF(ISBLANK(H29),\"\",COUNTIF(Q$24:Q29,Q29)-1)","v":5},6,null,"",null,"U15",172,176,"ung."]
["",null,null,null,null,null,null,0,"","",0,"","",null,"",{"$f":"IF(O30<>\"\",(LOOKUP(O30,Alterskategorie!$A$2:$A$111,Alterskategorie!$B$2:$B$111)),\"\")","v":""},1,{"$f":"IF(ISBLANK(H30),\"\",COUNTIF(Q$24:Q30,Q30)-1)","v":6},7,null,"",null,"U17",172,"ung.","ung."]
["",null,null,null,null,null,null,0,"","",0,"","",null,"",{"$f":"IF(O31<>\"\",(LOOKUP(O31,Alterskategorie!$A$2:$A$111,Alterskategorie!$B$2:$B$111)),\"\")","v":""},1,{"$f":"IF(ISBLANK(H31),\"\",COUNTIF(Q$24:Q31,Q31)-1)","v":7},8,null,"",null,"U19",176,"ung.","ung."]
["",null,null,null,null,null,null,0,"","",0,"","",null,"",{"$f":"IF(O32<>\"\",(LOOKUP(O32,Alterskategorie!$A$2:$A$111,Alterskategorie!$B$2:$B$111)),\"\")","v":""},1,{"$f":"IF(ISBLANK(H32),\"\",COUNTIF(Q$24:Q32,Q32)-1)","v":8},9,null,"",null,"U21",176,"ung.","ung."]
["",null,null,null,null,null,null,0,"","",0,"","",null,"",{"$f":"IF(O33<>\"\",(LOOKUP(O33,Alterskategorie!$A$2:$A$111,Alterskategorie!$B$2:$B$111)),\"\")","v":""},1,{"$f":"IF(ISBLANK(H33),\"\",COUNTIF(Q$24:Q33,Q33)-1)","v":9},10,null,"",null,"V",176,"ung.","ung."]
["",null,null,null,null,null,null,0,"","",0,"","",null,"",{"$f":"IF(O34<>\"\",(LOOKUP(O34,Alterskategorie!$A$2:$A$111,Alterskategorie!$B$2:$B$111)),\"\")","v":""},1,{"$f":"IF(ISBLANK(H34),\"\",COUNTIF(Q$24:Q34,Q34)-1)","v":10},11,null,"",null,"xx","ung.","ung.","ung."]
["",null,null,null,null,null,null,0,"","",0,"","",null,"",{"$f":"IF(O35<>\"\",(LOOKUP(O35,Alterskategorie!$A$2:$A$111,Alterskategorie!$B$2:$B$111)),\"\")","v":""},1,{"$f":"IF(ISBLANK(H35),\"\",COUNTIF(Q$24:Q35,Q35)-1)","v":11},12,null,""]
["",null,null,null,null,null,null,0,"","",0,"","",null,"",{"$f":"IF(O36<>\"\",(LOOKUP(O36,Alterskategorie!$A$2:$A$111,Alterskategorie!$B$2:$B$111)),\"\")","v":""},1,{"$f":"IF(ISBLANK(H36),\"\",COUNTIF(Q$24:Q36,Q36)-1)","v":12},13,null,""]
["",null,null,null,null,null,null,0,"","",0,"","",null,"",{"$f":"IF(O37<>\"\",(LOOKUP(O37,Alterskategorie!$A$2:$A$111,Alterskategorie!$B$2:$B$111)),\"\")","v":""},1,{"$f":"IF(ISBLANK(H37),\"\",COUNTIF(Q$24:Q37,Q37)-1)","v":13},14,null,""]
["",null,null,null,null,null,null,0,"","",0,"","",null,"",{"$f":"IF(O38<>\"\",(LOOKUP(O38,Alterskategorie!$A$2:$A$111,Alterskategorie!$B$2:$B$111)),\"\")","v":""},1,{"$f":"IF(ISBLANK(H38),\"\",COUNTIF(Q$24:Q38,Q38)-1)","v":14},15,null,""]
["",null,null,null,null,null,null,0,"","",0,"","",null,"",{"$f":"IF(O39<>\"\",(LOOKUP(O39,Alterskategorie!$A$2:$A$111,Alterskategorie!$B$2:$B$111)),\"\")","v":""},1,{"$f":"IF(ISBLANK(H39),\"\",COUNTIF(Q$24:Q39,Q39)-1)","v":15},16,null,""]
["",null,null,null,null,null,null,0,"","",0,"","",null,"",{"$f":"IF(O40<>\"\",(LOOKUP(O40,Alterskategorie!$A$2:$A$111,Alterskategorie!$B$2:$B$111)),\"\")","v":""},1,{"$f":"IF(ISBLANK(H40),\"\",COUNTIF(Q$24:Q40,Q40)-1)","v":16},17,null,""]
{"$rows_left_out":28}
{"sheet":"français","index":1,"n_rows":67,"n_cols":28,"rows_kept":67,"cut":false,"hidden":false,"merged":[[11,2,11,4],[11,8,11,12],[5,0,5,12],[6,3,6,4],[6,8,6,12],[7,2,7,4],[7,8,7,12],[8,2,8,4],[8,8,8,12],[9,0,10,1],[9,2,9,4],[9,8,9,12],[10,2,10,4],[10,8,10,12],[12,2,12,4],[12,8,12,12],[13,2,13,4],[13,8,13,12],[15,0,15,1],[15,8,15,10],[15,11,15,12],[22,22,22,25],[65,4,65,8],[16,8,16,10],[16,11,16,12],[17,8,17,10],[17,11,17,12],[18,8,18,10],[18,11,18,12],[66,4,66,8],[19,8,19,10],[19,11,19,12],[20,8,20,10],[20,11,20,12]]}
[null,null,"SCHWEIZER SCHIESSSPORTVERBAND",null,null,null,null,null,null,"Rolf Binz"]
[null,null,"FÉDÉRATION SPORTIVE SUISSE DE TIR",null,null,null,null,null,null,"Huntelweg 8"]
[null,null,"FEDERAZIONE SPORTIVA SVIZZERA DI TIRO",null,null,null,null,null,null,"4586 Buchegg"]
[null,null,null,null,null,null,null,null,null,"032 661 17 09"]
[null,null,"V2025_08",null,null,null,null,null,null,"binz-wirth@gawnet.ch"]
["__________________________________________________________________________________________________"]
["Concours des sociétés",null,null,2025,null,null,null,null,"Carabine 50 mètres"]
["Société :",null,"Nom de la société :",null,null,null,null,null,"Tireurs sportifs XY"]
[null,null,"Numéro de la société :",null,null,null,null,null,"1.02.XXXX"]
["Adresse pour la correspondance :",null,"Nom, Prénom :",null,null,null,null,null,"Modèle, Max"]
[null,null,"Rue/Rte :",null,null,null,null,null,"Route des Exemples"]
[null,null,"NPA/Lieu :",null,null,null,null,null,"1200 Genève"]
[null,null,"Tél :",null,null,null,null,null,"XXX XXX XX XX"]
[null,null,"Email :",null,null,null,null,null,"modèle@bluemail.ch"]
[]
["Membres licenciés :",null,null,null,null,null,null,null,"Résultat de société",null,null,{"$f":"ROUND((J66+K67)/D17,3)","v":0}]
["Résultats obligatoires :",null,null,{"$f":"IF(D16<10,6,ROUND(0.7*D16,0))","v":6}]
["Participants :",null,"E / S",{"$f":"COUNTIF($P$24:$P$65,\"E\")+COUNTIF($P$24:$P$65,\"S\")","v":0},null,null,null,null,"Cartes-couronnes",null,null,{"$f":"COUNT(M24:M65)","v":0}]
[null,null,"U10-U21",{"$f":"COUNTIF($P$24:$P$65,\"U10\")+COUNTIF($P$24:$P$65,\"U13\")+COUNTIF($P$24:$P$65,\"U15\")+COUNTIF($P$24:$P$65,\"U17\")++COUNTIF($P$24:$P$65,\"U19\")++COUNTIF($P$24:$P$65,\"U21\")","v":0},null,null,null,null,"Cartes de tireur sportif",null,null,{"$f":"COUNT(L24:L65)","v":0}]
[null,null,"V / SV",{"$f":"COUNTIF($P$24:$P$65,\"V\")+COUNTIF($P$24:$P$65,\"SV\")","v":0},null,null,null,null,"Nombre total de participants",null,null,{"$f":"COUNTIF(H24:H65,\">0\")","v":0}]
[null,null,null,null,null,null,null,null,"Participation",null,null,{"$f":"L20/D16","v":{"$error":"#DIV/0!"}}]
[]
["No","Nom","Prénom","Né en","Posi-tion","P1","P2","Total","Classe d'âge","Résultat obl.","Autre résultat","Carte TSp","Carte-cour.",null,"Alter","Alterskat.","Rang1","AnzGleich","Rang Kor.",null,"Kranz-SOLL",null,"Auszeichnungslimiten",null,null,null,null,"Stellg."]
[1,null,null,null,null,null,null,{"$f":"IF(F24>0,F24+G24,0)","v":0},{"$f":"IF(ISBLANK(O24),\"\",P24)","v":""},{"$f":"IF(S24<=$D$17,H24,\"\")","v":0},{"$f":"IF(ISBLANK(H24),\"\",IF(S24>D$17,H24,\"\"))","v":""},{"$f":"M24","v":""},{"$f":"IF(H24=\"\",\"\",IF(H24>=U24,1,\"\"))","v":""},null,{"$f":"IF(ISBLANK(D24),\"\",$D$7-D24)","v":""},{"$f":"IF(O24<>\"\",(LOOKUP(O24,Alterskategorie!$A$2:$A$111,Alterskategorie!$B$2:$B$111)),\"\")","v":""},{"$f":"IF(ISBLANK(H24),\"\",RANK(H24,H$24:H$65,0))","v":1},{"$f":"IF(ISBLANK(H24),\"\",COUNTIF(Q$24:Q24,Q24)-1)","v":0},{"$f":"IF(ISBLANK(H24),\"\",Q24+R24)","v":1},null,{"$f":"IF(D24<\"\",VLOOKUP(I24,$W$25:$Z$34,MATCH(E24,$W$24:$Z$24,)),\"\")","v":""},null,null,"LG-F","LG-A","XX",null,"LG-F"]
[{"$f":"IF(B25>\"\",A24+1,\"\")","v":""},null,null,null,null,null,null,0,"",0,"",{"$f":"M25","v":""},{"$f":"IF(H25=\"\",\"\",IF(H25>=U25,1,\"\"))","v":""},null,"",{"$f":"IF(O25<>\"\",(LOOKUP(O25,Alterskategorie!$A$2:$A$111,Alterskategorie!$B$2:$B$111)),\"\")","v":""},1,{"$f":"IF(ISBLANK(H25),\"\",COUNTIF(Q$24:Q25,Q25)-1)","v":1},2,null,{"$f":"IF(D25<\"\",VLOOKUP(I25,$W$25:$Z$34,MATCH(E25,$W$24:$Z$24,)),\"\")","v":""},null,"E",180,"ung.","ung.",null,"LG-A"]
[{"$f":"IF(B26>\"\",A25+1,\"\")","v":""},null,null,null,null,null,null,0,"",0,"","","",null,"",{"$f":"IF(O26<>\"\",(LOOKUP(O26,Alterskategorie!$A$2:$A$111,Alterskategorie!$B$2:$B$111)),\"\")","v":""},1,{"$f":"IF(ISBLANK(H26),\"\",COUNTIF(Q$24:Q26,Q26)-1)","v":2},3,null,"",null,"S",180,"ung.","ung.",null,"XX"]
["",null,null,null,null,null,null,0,"",0,"","","",null,"",{"$f":"IF(O27<>\"\",(LOOKUP(O27,Alterskategorie!$A$2:$A$111,Alterskategorie!$B$2:$B$111)),\"\")","v":""},1,{"$f":"IF(ISBLANK(H27),\"\",COUNTIF(Q$24:Q27,Q27)-1)","v":3},4,null,"",null,"SV",172,176,"ung.",null,"XX"]
["",null,null,null,null,null,null,0,"",0,"","","",null,"",{"$f":"IF(O28<>\"\",(LOOKUP(O28,Alterskategorie!$A$2:$A$111,Alterskategorie!$B$2:$B$111)),\"\")","v":""},1,{"$f":"IF(ISBLANK(H28),\"\",COUNTIF(Q$24:Q28,Q28)-1)","v":4},5,null,"",null,"U13",172,176,"ung."]
["",null,null,null,null,null,null,0,"",0,"","","",null,"",{"$f":"IF(O29<>\"\",(LOOKUP(O29,Alterskategorie!$A$2:$A$111,Alterskategorie!$B$2:$B$111)),\"\")","v":""},1,{"$f":"IF(ISBLANK(H29),\"\",COUNTIF(Q$24:Q29,Q29)-1)","v":5},6,null,"",null,"U15",172,176,"ung."]
["",null,null,null,null,null,null,0,"","",0,"","",null,"",{"$f":"IF(O30<>\"\",(LOOKUP(O30,Alterskategorie!$A$2:$A$111,Alterskategorie!$B$2:$B$111)),\"\")","v":""},1,{"$f":"IF(ISBLANK(H30),\"\",COUNTIF(Q$24:Q30,Q30)-1)","v":6},7,null,"",null,"U17",172,"ung.","ung."]
["",null,null,null,null,null,null,0,"","",0,"","",null,"",{"$f":"IF(O31<>\"\",(LOOKUP(O31,Alterskategorie!$A$2:$A$111,Alterskategorie!$B$2:$B$111)),\"\")","v":""},1,{"$f":"IF(ISBLANK(H31),\"\",COUNTIF(Q$24:Q31,Q31)-1)","v":7},8,null,"",null,"U19",176,"ung.","ung."]
["",null,null,null,null,null,null,0,"","",0,"","",null,"",{"$f":"IF(O32<>\"\",(LOOKUP(O32,Alterskategorie!$A$2:$A$111,Alterskategorie!$B$2:$B$111)),\"\")","v":""},1,{"$f":"IF(ISBLANK(H32),\"\",COUNTIF(Q$24:Q32,Q32)-1)","v":8},9,null,"",null,"U21",176,"ung.","ung."]
["",null,null,null,null,null,null,0,"","",0,"","",null,"",{"$f":"IF(O33<>\"\",(LOOKUP(O33,Alterskategorie!$A$2:$A$111,Alterskategorie!$B$2:$B$111)),\"\")","v":""},1,{"$f":"IF(ISBLANK(H33),\"\",COUNTIF(Q$24:Q33,Q33)-1)","v":9},10,null,"",null,"V",176,"ung.","ung."]
["",null,null,null,null,null,null,0,"","",0,"","",null,"",{"$f":"IF(O34<>\"\",(LOOKUP(O34,Alterskategorie!$A$2:$A$111,Alterskategorie!$B$2:$B$111)),\"\")","v":""},1,{"$f":"IF(ISBLANK(H34),\"\",COUNTIF(Q$24:Q34,Q34)-1)","v":10},11,null,"",null,"xx","ung.","ung.","ung."]
["",null,null,null,null,null,null,0,"","",0,"","",null,"",{"$f":"IF(O35<>\"\",(LOOKUP(O35,Alterskategorie!$A$2:$A$111,Alterskategorie!$B$2:$B$111)),\"\")","v":""},1,{"$f":"IF(ISBLANK(H35),\"\",COUNTIF(Q$24:Q35,Q35)-1)","v":11},12,null,""]
["",null,null,null,null,null,null,0,"","",0,"","",null,"",{"$f":"IF(O36<>\"\",(LOOKUP(O36,Alterskategorie!$A$2:$A$111,Alterskategorie!$B$2:$B$111)),\"\")","v":""},1,{"$f":"IF(ISBLANK(H36),\"\",COUNTIF(Q$24:Q36,Q36)-1)","v":12},13,null,""]
["",null,null,null,null,null,null,0,"","",0,"","",null,"",{"$f":"IF(O37<>\"\",(LOOKUP(O37,Alterskategorie!$A$2:$A$111,Alterskategorie!$B$2:$B$111)),\"\")","v":""},1,{"$f":"IF(ISBLANK(H37),\"\",COUNTIF(Q$24:Q37,Q37)-1)","v":13},14,null,""]
["",null,null,null,null,null,null,0,"","",0,"","",null,"",{"$f":"IF(O38<>\"\",(LOOKUP(O38,Alterskategorie!$A$2:$A$111,Alterskategorie!$B$2:$B$111)),\"\")","v":""},1,{"$f":"IF(ISBLANK(H38),\"\",COUNTIF(Q$24:Q38,Q38)-1)","v":14},15,null,""]
["",null,null,null,null,null,null,0,"","",0,"","",null,"",{"$f":"IF(O39<>\"\",(LOOKUP(O39,Alterskategorie!$A$2:$A$111,Alterskategorie!$B$2:$B$111)),\"\")","v":""},1,{"$f":"IF(ISBLANK(H39),\"\",COUNTIF(Q$24:Q39,Q39)-1)","v":15},16,null,""]
["",null,null,null,null,null,null,0,"","",0,"","",null,"",{"$f":"IF(O40<>\"\",(LOOKUP(O40,Alterskategorie!$A$2:$A$111,Alterskategorie!$B$2:$B$111)),\"\")","v":""},1,{"$f":"IF(ISBLANK(H40),\"\",COUNTIF(Q$24:Q40,Q40)-1)","v":16},17,null,""]
{"$rows_left_out":28}
{"sheet":"Alterskategorie","index":2,"n_rows":111,"n_cols":2,"rows_kept":111,"cut":false,"hidden":true,"merged":[]}
["Alter","Kategorie"]
[1,"-"]
[2,"-"]
[3,"-"]
[4,"-"]
[5,"-"]
[6,"-"]
[7,"U10"]
[8,"U10"]
[9,"U10"]
[10,"U13"]
[11,"U13"]
[12,"U13"]
[13,"U15"]
[14,"U15"]
[15,"U17"]
[16,"U17"]
[17,"U19"]
[18,"U19"]
[19,"U21"]
[20,"U21"]
[21,"E"]
[22,"E"]
[23,"E"]
[24,"E"]
[25,"E"]
[26,"E"]
[27,"E"]
[28,"E"]
[29,"E"]
[30,"E"]
[31,"E"]
[32,"E"]
[33,"E"]
[34,"E"]
[35,"E"]
[36,"E"]
[37,"E"]
[38,"E"]
[39,"E"]
{"$rows_left_out":71}