{"text_format":"1","workbook":"xlsx","n_sheets":11,"sheets":["Go","result","copy","Neu","r","1","2","3","4","5","Random"],"not_rendered":{"charts":0,"images":0,"macros":1,"external_links":0,"defined_names":0,"comments":0,"pivot_tables":0},"unopened":[],"bounds":{"document_bytes":16777216,"sheet_cells":100000,"rows_first":2000,"rows_last":500,"rows_between":2000,"halvings":0,"cell_chars":16384,"cell_head_chars":4096},"cells_cut":0,"cells_raw":0,"read":"whole","date_system":"1900"}

{"sheet":"Go","index":0,"n_rows":57,"n_cols":38,"rows_kept":57,"cut":false,"hidden":false,"merged":[[14,36,14,37],[15,36,15,37],[3,36,3,37],[1,16,1,17],[1,3,1,5],[1,14,1,15],[1,8,1,9],[1,10,1,11],[1,12,1,13],[1,6,1,7]]}
[]
[null,null,null,"exercice",null,null,"Random",null,"police",null,"Ͼ Ͽ",null,"time",null,"00:12:00"]
[]
[null,null,null,null,"Suche das folgenden Muster / cherche le dessin suivant :",null,null,null,null,null,null,null,null,null,null,null,null,null,null,null,null,null,null,null,{"$f":"copy!$D$3","v":"Ͼ"},{"$f":"copy!$D$3","v":"Ͼ"},{"$f":"copy!$F$3","v":"Ͽ"},null,null,null,null,null,null,null,null,null,"Resultat - résultat"]
[]
[null,null,null,"Wähle eine Übunbsnummer von 1 bis 5 oder den Zufallsgenerator Random und und klicke auf",null,null,null,null,null,null,null,null,null,null,null,null,null,null,null,null,null,"Choisi un no d'excercice de 1 à 5 ou coche l'aléatoire avant cliquer sur \"start\"."]
[null,"status",null,"\"start\". Anschliessend erscheinen in der Tabelle durcheinander zwei Zeichen. Klicke nun, wie",null,null,null,null,null,null,null,null,null,null,null,null,null,null,null,null,null,"Deux sortes de caractères s'affichent. Clique sur tous les caractère dun type",null,null,null,null,null,null,null,null,null,null,null,null,null,null,"Markiert - marqués",{"$f":"result!AL51","v":0}]
[null,"READY?",null,"im Beispiel unten angezeigt, auf alle Zeichen, welche linienübergreifend auf zwei gleiche folgen!",null,null,null,null,null,null,null,null,null,null,null,null,null,null,null,null,null,"qui suivent les deux caractères de l'autre type, comme l'exemple indique",null,null,null,null,null,null,null,null,null,null,null,null,null,null,"Gefunden - trouvés",{"$f":"result!AL52","v":0}]
{"$rows_left_out":50}
{"sheet":"result","index":1,"n_rows":136,"n_cols":38,"rows_kept":136,"cut":false,"hidden":true,"merged":[]}
[]
[]
[]
[null,null,null,"X",1,2,3,4,5,6,7,8,9,10,11,12,13,14,15,16,17,18,19,20,21,22,23,24,25,26,27,28,29,30,"X"]
[null,null,null,1,{"$f":"IF($A$1=\"\",\"\",IF(AND(E52=\"\",OR(E96=\"\",E96=\"%\")),\"\",IF(AND(E52<>\"\",E96=1),1,IF(AND(E52<>\"\",E96=\"\"),\"f\",\"x\"))))","v":""},{"$f":"IF($A$1=\"\",\"\",IF(AND(F52=\"\",OR(F96=\"\",F96=\"%\")),\"\",IF(AND(F52<>\"\",F96=1),1,IF(AND(F52<>\"\",F96=\"\"),\"f\",\"x\"))))","v":""},"","","","","","","","","","","","","","","","","","","","","","","","","","","","",1]
[null,null,null,2,{"$f":"IF($A$1=\"\",\"\",IF(AND(E53=\"\",OR(E97=\"\",E97=\"%\")),\"\",IF(AND(E53<>\"\",E97=1),1,IF(AND(E53<>\"\",E97=\"\"),\"f\",\"x\"))))","v":""},"","","","","","","","","","","","","","","","","","","","","","","","","","","","","",2]
[null,null,null,3,{"$f":"IF($A$1=\"\",\"\",IF(AND(E54=\"\",OR(E98=\"\",E98=\"%\")),\"\",IF(AND(E54<>\"\",E98=1),1,IF(AND(E54<>\"\",E98=\"\"),\"f\",\"x\"))))","v":""},"","","","","","","","","","","","","","","","","","","","","","","","","","","","","",3]
[null,null,null,4,{"$f":"IF($A$1=\"\",\"\",IF(AND(E55=\"\",OR(E99=\"\",E99=\"%\")),\"\",IF(AND(E55<>\"\",E99=1),1,IF(AND(E55<>\"\",E99=\"\"),\"f\",\"x\"))))","v":""},"","","","","","","","","","","","","","","","","","","","","","","","","","","","","",4]
{"$rows_left_out":129}
{"sheet":"copy","index":2,"n_rows":47,"n_cols":39,"rows_kept":47,"cut":false,"hidden":true,"merged":[]}
[]
[]
[null,null,null,{"$f":"VLOOKUP(Go!K2,copy!AK6:AM13,2,FALSE)","v":"Ͼ"},null,{"$f":"VLOOKUP(Go!K2,copy!AK6:AM13,3,FALSE)","v":"Ͽ"}]
[]
[null,null,null,null,"c","d","e","f","g","h","i","j","k","l","m","n","o","p","q","r","s","t","u","v","w","x","y","z","aa","ab","ac","ad","ae","af",null,null,"Choise","1","2"]
[null,null,null,"x",1,2,3,4,5,6,7,8,9,10,11,12,13,14,15,16,17,18,19,20,21,22,23,24,25,26,27,28,29,30,"x",null,"Ͼ Ͽ","Ͼ","Ͽ"]
[null,"status",null,1,{"$f":"IF(INDIRECT(\"'\"&Go!$G$2&\"'!\"&E$5&$AJ7)=1,$D$3,$F$3)","v":"Ͼ"},{"$f":"IF(INDIRECT(\"'\"&Go!$G$2&\"'!\"&F$5&$AJ7)=1,$D$3,$F$3)","v":"Ͼ"},{"$f":"IF(INDIRECT(\"'\"&Go!$G$2&\"'!\"&G$5&$AJ7)=1,$D$3,$F$3)","v":"Ͼ"},{"$f":"IF(INDIRECT(\"'\"&Go!$G$2&\"'!\"&H$5&$AJ7)=1,$D$3,$F$3)","v":"Ͼ"},{"$f":"IF(INDIRECT(\"'\"&Go!$G$2&\"'!\"&I$5&$AJ7)=1,$D$3,$F$3)","v":"Ͼ"},{"$f":"IF(INDIRECT(\"'\"&Go!$G$2&\"'!\"&J$5&$AJ7)=1,$D$3,$F$3)","v":"Ͼ"},{"$f":"IF(INDIRECT(\"'\"&Go!$G$2&\"'!\"&K$5&$AJ7)=1,$D$3,$F$3)","v":"Ͽ"},{"$f":"IF(INDIRECT(\"'\"&Go!$G$2&\"'!\"&L$5&$AJ7)=1,$D$3,$F$3)","v":"Ͼ"},{"$f":"IF(INDIRECT(\"'\"&Go!$G$2&\"'!\"&M$5&$AJ7)=1,$D$3,$F$3)","v":"Ͽ"},{"$f":"IF(INDIRECT(\"'\"&Go!$G$2&\"'!\"&N$5&$AJ7)=1,$D$3,$F$3)","v":"Ͽ"},{"$f":"IF(INDIRECT(\"'\"&Go!$G$2&\"'!\"&O$5&$AJ7)=1,$D$3,$F$3)","v":"Ͽ"},{"$f":"IF(INDIRECT(\"'\"&Go!$G$2&\"'!\"&P$5&$AJ7)=1,$D$3,$F$3)","v":"Ͼ"},{"$f":"IF(INDIRECT(\"'\"&Go!$G$2&\"'!\"&Q$5&$AJ7)=1,$D$3,$F$3)","v":"Ͽ"},{"$f":"IF(INDIRECT(\"'\"&Go!$G$2&\"'!\"&R$5&$AJ7)=1,$D$3,$F$3)","v":"Ͽ"},{"$f":"IF(INDIRECT(\"'\"&Go!$G$2&\"'!\"&S$5&$AJ7)=1,$D$3,$F$3)","v":"Ͼ"},{"$f":"IF(INDIRECT(\"'\"&Go!$G$2&\"'!\"&T$5&$AJ7)=1,$D$3,$F$3)","v":"Ͼ"},{"$f":"IF(INDIRECT(\"'\"&Go!$G$2&\"'!\"&U$5&$AJ7)=1,$D$3,$F$3)","v":"Ͽ"},{"$f":"IF(INDIRECT(\"'\"&Go!$G$2&\"'!\"&V$5&$AJ7)=1,$D$3,$F$3)","v":"Ͼ"},{"$f":"IF(INDIRECT(\"'\"&Go!$G$2&\"'!\"&W$5&$AJ7)=1,$D$3,$F$3)","v":"Ͽ"},{"$f":"IF(INDIRECT(\"'\"&Go!$G$2&\"'!\"&X$5&$AJ7)=1,$D$3,$F$3)","v":"Ͼ"},{"$f":"IF(INDIRECT(\"'\"&Go!$G$2&\"'!\"&Y$5&$AJ7)=1,$D$3,$F$3)","v":"Ͼ"},{"$f":"IF(INDIRECT(\"'\"&Go!$G$2&\"'!\"&Z$5&$AJ7)=1,$D$3,$F$3)","v":"Ͼ"},{"$f":"IF(INDIRECT(\"'\"&Go!$G$2&\"'!\"&AA$5&$AJ7)=1,$D$3,$F$3)","v":"Ͼ"},{"$f":"IF(INDIRECT(\"'\"&Go!$G$2&\"'!\"&AB$5&$AJ7)=1,$D$3,$F$3)","v":"Ͽ"},{"$f":"IF(INDIRECT(\"'\"&Go!$G$2&\"'!\"&AC$5&$AJ7)=1,$D$3,$F$3)","v":"Ͼ"},{"$f":"IF(INDIRECT(\"'\"&Go!$G$2&\"'!\"&AD$5&$AJ7)=1,$D$3,$F$3)","v":"Ͼ"},{"$f":"IF(INDIRECT(\"'\"&Go!$G$2&\"'!\"&AE$5&$AJ7)=1,$D$3,$F$3)","v":"Ͼ"},{"$f":"IF(INDIRECT(\"'\"&Go!$G$2&\"'!\"&AF$5&$AJ7)=1,$D$3,$F$3)","v":"Ͽ"},{"$f":"IF(INDIRECT(\"'\"&Go!$G$2&\"'!\"&AG$5&$AJ7)=1,$D$3,$F$3)","v":"Ͼ"},{"$f":"IF(INDIRECT(\"'\"&Go!$G$2&\"'!\"&AH$5&$AJ7)=1,$D$3,$F$3)","v":"Ͼ"},1,3,"x +","x","+"]
[null,"GO!",null,2,{"$f":"IF(INDIRECT(\"'\"&Go!$G$2&\"'!\"&E$5&$AJ8)=1,$D$3,$F$3)","v":"Ͼ"},{"$f":"IF(INDIRECT(\"'\"&Go!$G$2&\"'!\"&F$5&$AJ8)=1,$D$3,$F$3)","v":"Ͼ"},{"$f":"IF(INDIRECT(\"'\"&Go!$G$2&\"'!\"&G$5&$AJ8)=1,$D$3,$F$3)","v":"Ͽ"},{"$f":"IF(INDIRECT(\"'\"&Go!$G$2&\"'!\"&H$5&$AJ8)=1,$D$3,$F$3)","v":"Ͽ"},{"$f":"IF(INDIRECT(\"'\"&Go!$G$2&\"'!\"&I$5&$AJ8)=1,$D$3,$F$3)","v":"Ͼ"},{"$f":"IF(INDIRECT(\"'\"&Go!$G$2&\"'!\"&J$5&$AJ8)=1,$D$3,$F$3)","v":"Ͽ"},{"$f":"IF(INDIRECT(\"'\"&Go!$G$2&\"'!\"&K$5&$AJ8)=1,$D$3,$F$3)","v":"Ͼ"},{"$f":"IF(INDIRECT(\"'\"&Go!$G$2&\"'!\"&L$5&$AJ8)=1,$D$3,$F$3)","v":"Ͽ"},{"$f":"IF(INDIRECT(\"'\"&Go!$G$2&\"'!\"&M$5&$AJ8)=1,$D$3,$F$3)","v":"Ͽ"},{"$f":"IF(INDIRECT(\"'\"&Go!$G$2&\"'!\"&N$5&$AJ8)=1,$D$3,$F$3)","v":"Ͼ"},{"$f":"IF(INDIRECT(\"'\"&Go!$G$2&\"'!\"&O$5&$AJ8)=1,$D$3,$F$3)","v":"Ͽ"},{"$f":"IF(INDIRECT(\"'\"&Go!$G$2&\"'!\"&P$5&$AJ8)=1,$D$3,$F$3)","v":"Ͼ"},{"$f":"IF(INDIRECT(\"'\"&Go!$G$2&\"'!\"&Q$5&$AJ8)=1,$D$3,$F$3)","v":"Ͼ"},{"$f":"IF(INDIRECT(\"'\"&Go!$G$2&\"'!\"&R$5&$AJ8)=1,$D$3,$F$3)","v":"Ͼ"},{"$f":"IF(INDIRECT(\"'\"&Go!$G$2&\"'!\"&S$5&$AJ8)=1,$D$3,$F$3)","v":"Ͼ"},{"$f":"IF(INDIRECT(\"'\"&Go!$G$2&\"'!\"&T$5&$AJ8)=1,$D$3,$F$3)","v":"Ͼ"},{"$f":"IF(INDIRECT(\"'\"&Go!$G$2&\"'!\"&U$5&$AJ8)=1,$D$3,$F$3)","v":"Ͽ"},{"$f":"IF(INDIRECT(\"'\"&Go!$G$2&\"'!\"&V$5&$AJ8)=1,$D$3,$F$3)","v":"Ͼ"},{"$f":"IF(INDIRECT(\"'\"&Go!$G$2&\"'!\"&W$5&$AJ8)=1,$D$3,$F$3)","v":"Ͽ"},{"$f":"IF(INDIRECT(\"'\"&Go!$G$2&\"'!\"&X$5&$AJ8)=1,$D$3,$F$3)","v":"Ͼ"},{"$f":"IF(INDIRECT(\"'\"&Go!$G$2&\"'!\"&Y$5&$AJ8)=1,$D$3,$F$3)","v":"Ͼ"},{"$f":"IF(INDIRECT(\"'\"&Go!$G$2&\"'!\"&Z$5&$AJ8)=1,$D$3,$F$3)","v":"Ͼ"},{"$f":"IF(INDIRECT(\"'\"&Go!$G$2&\"'!\"&AA$5&$AJ8)=1,$D$3,$F$3)","v":"Ͽ"},{"$f":"IF(INDIRECT(\"'\"&Go!$G$2&\"'!\"&AB$5&$AJ8)=1,$D$3,$F$3)","v":"Ͽ"},{"$f":"IF(INDIRECT(\"'\"&Go!$G$2&\"'!\"&AC$5&$AJ8)=1,$D$3,$F$3)","v":"Ͽ"},{"$f":"IF(INDIRECT(\"'\"&Go!$G$2&\"'!\"&AD$5&$AJ8)=1,$D$3,$F$3)","v":"Ͽ"},{"$f":"IF(INDIRECT(\"'\"&Go!$G$2&\"'!\"&AE$5&$AJ8)=1,$D$3,$F$3)","v":"Ͽ"},{"$f":"IF(INDIRECT(\"'\"&Go!$G$2&\"'!\"&AF$5&$AJ8)=1,$D$3,$F$3)","v":"Ͽ"},{"$f":"IF(INDIRECT(\"'\"&Go!$G$2&\"'!\"&AG$5&$AJ8)=1,$D$3,$F$3)","v":"Ͼ"},{"$f":"IF(INDIRECT(\"'\"&Go!$G$2&\"'!\"&AH$5&$AJ8)=1,$D$3,$F$3)","v":"Ͼ"},2,4,": ;",":",";"]
{"$rows_left_out":40}
{"sheet":"Neu","index":3,"n_rows":221,"n_cols":40,"rows_kept":221,"cut":false,"hidden":true,"merged":[]}
[]
[]
[]
[]
[]
[null,null,null,"Wähle eine Übunbsnummer von 1 bis 5 oder den Zufallsgenerator Random und und klicke auf",null,null,null,null,null,null,null,null,null,null,null,null,null,null,null,null,null,"Choisi un no d'excercice de 1 à 5 ou coche l'aléatoire avant cliquer sur \"start\".",null,null,null,null,null,null,null,null,null,null,null,null,null,null,null,1,"Ͼ Ͽ","00:12:00"]
[null,"status",null,"\"start\". Anschliessend erscheinen in der Tabelle durcheinander zwei Zeichen. Klicke nun, wie",null,null,null,null,null,null,null,null,null,null,null,null,null,null,null,null,null,"Deux sortes de caractères s'affichent. Clique sur tous les caractère dun type",null,null,null,null,null,null,null,null,null,null,null,null,null,null,null,2,"x +","00:10:00"]
[null,"READY?",null,"im Beispiel unten angezeigt, auf alle Zeichen, welche linienübergreifend auf zwei gleiche folgen!",null,null,null,null,null,null,null,null,null,null,null,null,null,null,null,null,null,"qui suivent les deux caractères de l'autre type, comme l'exemple indique",null,null,null,null,null,null,null,null,null,null,null,null,null,null,null,3,": ;","00:05:00"]
{"$rows_left_out":214}
{"sheet":"r","index":4,"n_rows":42,"n_cols":33,"rows_kept":42,"cut":false,"hidden":true,"merged":[]}
[null,null,1,2,3,4,5,6,7,8,9,10,11,12,13,14,15,16,17,18,19,20,21,22,23,24,25,26,27,28,29,30]
[null,1,{"$f":"RANDBETWEEN(1,2)","v":1},1,1,1,1,1,2,1,2,2,2,1,2,2,1,1,2,1,2,1,1,1,1,2,1,1,1,2,1,1,1]
[null,2,1,1,2,2,1,2,1,2,2,1,2,1,1,1,1,1,2,1,2,1,1,1,2,2,2,2,2,2,1,1,2]
[null,3,1,2,1,2,1,2,2,2,2,2,1,2,2,1,2,1,2,2,1,2,1,1,2,2,1,1,2,2,2,2,3]
[null,4,2,2,2,2,1,1,1,2,1,2,1,2,1,2,2,2,2,1,1,1,1,1,2,1,1,2,2,1,2,2,4]
[null,5,1,2,1,1,1,2,2,2,1,1,2,1,1,1,2,2,1,2,2,2,1,2,2,1,2,2,1,1,1,2,5]
[null,6,1,2,2,1,1,1,1,1,2,2,2,2,1,2,2,2,1,2,1,1,1,2,1,2,2,2,1,2,2,2,6]
[null,7,1,1,2,1,2,2,2,2,1,1,2,1,1,2,1,1,1,1,2,1,1,1,2,1,1,2,2,1,1,2,7]
{"$rows_left_out":35}
{"sheet":"1","index":5,"n_rows":43,"n_cols":33,"rows_kept":43,"cut":false,"hidden":true,"merged":[]}
[]
[null,"X",1,2,3,4,5,6,7,8,9,10,11,12,13,14,15,16,17,18,19,20,21,22,23,24,25,26,27,28,29,30,"X"]
[null,1,2,2,2,1,2,2,2,1,2,1,2,2,2,1,2,1,1,2,1,2,1,1,1,1,2,1,2,2,2,1,1]
[null,2,2,1,2,1,2,1,2,2,1,1,1,2,2,2,1,2,2,1,2,2,2,2,2,2,1,1,2,2,2,2,2]
[null,3,2,1,2,2,1,2,2,1,1,2,2,2,2,1,2,2,1,2,2,1,2,1,1,2,1,1,2,2,2,1,3]
[null,4,2,2,1,1,1,1,2,1,2,2,2,1,1,1,2,2,1,2,2,1,2,1,2,1,1,2,2,1,1,1,4]
[null,5,2,1,2,1,2,2,2,2,2,2,2,1,2,2,1,2,1,2,2,2,2,1,2,1,1,2,1,2,1,2,5]
[null,6,1,1,1,2,1,2,1,2,1,1,2,1,1,2,2,2,2,1,1,1,2,1,2,1,1,1,1,2,1,2,6]
{"$rows_left_out":36}
{"sheet":"2","index":6,"n_rows":43,"n_cols":33,"rows_kept":43,"cut":false,"hidden":true,"merged":[]}
[]
[null,"X",1,2,3,4,5,6,7,8,9,10,11,12,13,14,15,16,17,18,19,20,21,22,23,24,25,26,27,28,29,30,"X"]
[null,1,2,1,1,2,2,1,2,2,1,1,1,1,1,2,2,2,1,1,2,2,1,1,2,1,1,1,2,1,2,1,1]
[null,2,1,2,1,1,1,1,1,1,1,2,1,1,2,2,2,2,2,2,1,2,2,1,2,1,2,1,2,2,1,1,2]
[null,3,1,2,1,1,1,2,2,2,1,2,1,2,2,1,2,1,1,1,1,2,1,2,1,2,2,2,2,2,2,1,3]
[null,4,2,1,2,1,1,1,2,1,2,1,2,2,1,1,2,2,1,2,1,1,1,1,1,2,1,2,2,2,1,2,4]
[null,5,1,1,1,1,1,2,1,1,2,1,1,1,1,1,2,2,1,2,1,2,2,2,1,2,2,2,2,1,1,2,5]
[null,6,1,1,2,1,2,1,2,2,1,2,1,1,1,1,1,1,1,2,1,2,2,2,2,2,1,1,2,2,1,2,6]
{"$rows_left_out":36}
{"sheet":"3","index":7,"n_rows":43,"n_cols":33,"rows_kept":43,"cut":false,"hidden":true,"merged":[]}
[]
[null,"X",1,2,3,4,5,6,7,8,9,10,11,12,13,14,15,16,17,18,19,20,21,22,23,24,25,26,27,28,29,30,"X"]
[null,1,2,1,1,1,2,2,2,1,2,1,2,2,1,2,1,2,2,1,2,2,2,1,2,1,1,1,2,2,1,1,1]
[null,2,2,1,2,2,1,2,2,2,1,2,1,2,1,2,1,2,1,1,2,2,2,1,1,2,1,1,2,2,2,1,2]
[null,3,1,1,2,1,2,2,2,2,2,2,1,2,1,2,1,2,1,2,2,2,1,1,1,2,2,1,1,2,1,2,3]
[null,4,2,2,2,1,2,1,2,2,1,1,1,1,2,1,2,2,2,2,2,1,1,2,1,2,1,1,2,1,1,2,4]
[null,5,1,2,2,2,1,2,1,1,1,2,1,1,2,2,2,2,1,1,1,2,1,2,1,2,2,1,2,1,2,2,5]
[null,6,1,1,1,1,1,2,1,1,2,2,1,2,1,2,1,2,2,1,1,1,1,1,2,1,2,2,2,2,1,1,6]
{"$rows_left_out":36}
{"sheet":"4","index":8,"n_rows":43,"n_cols":33,"rows_kept":43,"cut":false,"hidden":true,"merged":[]}
[]
[null,"X",1,2,3,4,5,6,7,8,9,10,11,12,13,14,15,16,17,18,19,20,21,22,23,24,25,26,27,28,29,30,"X"]
[null,1,2,2,1,1,1,2,1,1,1,1,2,2,1,1,1,2,1,1,1,2,1,1,2,1,2,2,1,1,1,1,1]
[null,2,2,2,2,2,2,1,1,2,1,1,2,2,1,1,2,2,2,1,2,2,1,1,2,1,2,1,2,1,2,2,2]
[null,3,2,1,1,2,2,1,1,1,2,2,2,2,1,2,1,2,1,2,2,2,1,2,2,2,2,1,2,2,1,2,3]
[null,4,1,2,2,1,1,2,1,2,1,1,2,1,1,2,1,2,1,2,2,2,2,1,1,2,2,2,1,2,2,2,4]
[null,5,1,1,1,1,2,2,1,2,2,1,1,2,2,2,1,1,2,2,1,1,1,1,1,2,1,1,2,2,2,2,5]
[null,6,1,1,2,2,2,2,2,1,1,1,2,1,1,1,1,2,1,1,1,1,1,1,2,2,2,2,1,2,1,1,6]
{"$rows_left_out":36}
{"sheet":"5","index":9,"n_rows":43,"n_cols":33,"rows_kept":43,"cut":false,"hidden":true,"merged":[]}
[]
[null,"X",1,2,3,4,5,6,7,8,9,10,11,12,13,14,15,16,17,18,19,20,21,22,23,24,25,26,27,28,29,30,"X"]
[null,1,2,2,1,2,1,1,1,2,1,2,1,1,2,1,2,2,1,2,1,1,1,2,2,2,1,2,2,2,1,2,1]
[null,2,1,2,1,1,1,2,2,2,1,1,2,2,1,1,1,1,2,1,2,1,1,1,1,2,2,2,1,1,2,2,2]
[null,3,2,1,2,1,2,2,1,2,2,1,1,2,2,2,1,2,1,1,2,1,1,1,1,2,1,2,1,2,1,1,3]
[null,4,2,1,2,2,1,2,2,2,2,2,2,2,1,2,2,1,2,2,2,2,2,2,2,1,1,1,2,1,2,1,4]
[null,5,2,2,2,2,1,1,2,1,1,2,1,2,1,2,2,1,1,1,1,2,1,1,1,2,1,1,2,1,2,2,5]
[null,6,2,1,1,1,2,1,1,2,1,1,1,2,1,1,2,2,1,1,1,1,1,2,2,1,1,2,1,1,2,2,6]
{"$rows_left_out":36}
{"sheet":"Random","index":10,"n_rows":43,"n_cols":33,"rows_kept":43,"cut":false,"hidden":true,"merged":[]}
[]
[null,"X",1,2,3,4,5,6,7,8,9,10,11,12,13,14,15,16,17,18,19,20,21,22,23,24,25,26,27,28,29,30,"X"]
[null,1,{"$f":"'r'!C2","v":1},{"$f":"'r'!D2","v":1},{"$f":"'r'!E2","v":1},{"$f":"'r'!F2","v":1},{"$f":"'r'!G2","v":1},{"$f":"'r'!H2","v":1},{"$f":"'r'!I2","v":2},{"$f":"'r'!J2","v":1},{"$f":"'r'!K2","v":2},{"$f":"'r'!L2","v":2},{"$f":"'r'!M2","v":2},{"$f":"'r'!N2","v":1},{"$f":"'r'!O2","v":2},{"$f":"'r'!P2","v":2},{"$f":"'r'!Q2","v":1},{"$f":"'r'!R2","v":1},{"$f":"'r'!S2","v":2},{"$f":"'r'!T2","v":1},{"$f":"'r'!U2","v":2},{"$f":"'r'!V2","v":1},{"$f":"'r'!W2","v":1},{"$f":"'r'!X2","v":1},{"$f":"'r'!Y2","v":1},{"$f":"'r'!Z2","v":2},{"$f":"'r'!AA2","v":1},{"$f":"'r'!AB2","v":1},{"$f":"'r'!AC2","v":1},{"$f":"'r'!AD2","v":2},{"$f":"'r'!AE2","v":1},{"$f":"'r'!AF2","v":1},1]
[null,2,{"$f":"'r'!C3","v":1},{"$f":"'r'!D3","v":1},{"$f":"'r'!E3","v":2},{"$f":"'r'!F3","v":2},{"$f":"'r'!G3","v":1},{"$f":"'r'!H3","v":2},{"$f":"'r'!I3","v":1},{"$f":"'r'!J3","v":2},{"$f":"'r'!K3","v":2},{"$f":"'r'!L3","v":1},{"$f":"'r'!M3","v":2},{"$f":"'r'!N3","v":1},{"$f":"'r'!O3","v":1},{"$f":"'r'!P3","v":1},{"$f":"'r'!Q3","v":1},{"$f":"'r'!R3","v":1},{"$f":"'r'!S3","v":2},{"$f":"'r'!T3","v":1},{"$f":"'r'!U3","v":2},{"$f":"'r'!V3","v":1},{"$f":"'r'!W3","v":1},{"$f":"'r'!X3","v":1},{"$f":"'r'!Y3","v":2},{"$f":"'r'!Z3","v":2},{"$f":"'r'!AA3","v":2},{"$f":"'r'!AB3","v":2},{"$f":"'r'!AC3","v":2},{"$f":"'r'!AD3","v":2},{"$f":"'r'!AE3","v":1},{"$f":"'r'!AF3","v":1},2]
[null,3,{"$f":"'r'!C4","v":1},{"$f":"'r'!D4","v":2},{"$f":"'r'!E4","v":1},{"$f":"'r'!F4","v":2},{"$f":"'r'!G4","v":1},{"$f":"'r'!H4","v":2},{"$f":"'r'!I4","v":2},{"$f":"'r'!J4","v":2},{"$f":"'r'!K4","v":2},{"$f":"'r'!L4","v":2},{"$f":"'r'!M4","v":1},{"$f":"'r'!N4","v":2},{"$f":"'r'!O4","v":2},{"$f":"'r'!P4","v":1},{"$f":"'r'!Q4","v":2},{"$f":"'r'!R4","v":1},{"$f":"'r'!S4","v":2},{"$f":"'r'!T4","v":2},{"$f":"'r'!U4","v":1},{"$f":"'r'!V4","v":2},{"$f":"'r'!W4","v":1},{"$f":"'r'!X4","v":1},{"$f":"'r'!Y4","v":2},{"$f":"'r'!Z4","v":2},{"$f":"'r'!AA4","v":1},{"$f":"'r'!AB4","v":1},{"$f":"'r'!AC4","v":2},{"$f":"'r'!AD4","v":2},{"$f":"'r'!AE4","v":2},{"$f":"'r'!AF4","v":2},3]
[null,4,{"$f":"'r'!C5","v":2},{"$f":"'r'!D5","v":2},{"$f":"'r'!E5","v":2},{"$f":"'r'!F5","v":2},{"$f":"'r'!G5","v":1},{"$f":"'r'!H5","v":1},{"$f":"'r'!I5","v":1},{"$f":"'r'!J5","v":2},{"$f":"'r'!K5","v":1},{"$f":"'r'!L5","v":2},{"$f":"'r'!M5","v":1},{"$f":"'r'!N5","v":2},{"$f":"'r'!O5","v":1},{"$f":"'r'!P5","v":2},{"$f":"'r'!Q5","v":2},{"$f":"'r'!R5","v":2},{"$f":"'r'!S5","v":2},{"$f":"'r'!T5","v":1},{"$f":"'r'!U5","v":1},{"$f":"'r'!V5","v":1},{"$f":"'r'!W5","v":1},{"$f":"'r'!X5","v":1},{"$f":"'r'!Y5","v":2},{"$f":"'r'!Z5","v":1},{"$f":"'r'!AA5","v":1},{"$f":"'r'!AB5","v":2},{"$f":"'r'!AC5","v":2},{"$f":"'r'!AD5","v":1},{"$f":"'r'!AE5","v":2},{"$f":"'r'!AF5","v":2},4]
[null,5,{"$f":"'r'!C6","v":1},{"$f":"'r'!D6","v":2},{"$f":"'r'!E6","v":1},{"$f":"'r'!F6","v":1},{"$f":"'r'!G6","v":1},{"$f":"'r'!H6","v":2},{"$f":"'r'!I6","v":2},{"$f":"'r'!J6","v":2},{"$f":"'r'!K6","v":1},{"$f":"'r'!L6","v":1},{"$f":"'r'!M6","v":2},{"$f":"'r'!N6","v":1},{"$f":"'r'!O6","v":1},{"$f":"'r'!P6","v":1},{"$f":"'r'!Q6","v":2},{"$f":"'r'!R6","v":2},{"$f":"'r'!S6","v":1},{"$f":"'r'!T6","v":2},{"$f":"'r'!U6","v":2},{"$f":"'r'!V6","v":2},{"$f":"'r'!W6","v":1},{"$f":"'r'!X6","v":2},{"$f":"'r'!Y6","v":2},{"$f":"'r'!Z6","v":1},{"$f":"'r'!AA6","v":2},{"$f":"'r'!AB6","v":2},{"$f":"'r'!AC6","v":1},{"$f":"'r'!AD6","v":1},{"$f":"'r'!AE6","v":1},{"$f":"'r'!AF6","v":2},5]
[null,6,{"$f":"'r'!C7","v":1},{"$f":"'r'!D7","v":2},{"$f":"'r'!E7","v":2},{"$f":"'r'!F7","v":1},{"$f":"'r'!G7","v":1},{"$f":"'r'!H7","v":1},{"$f":"'r'!I7","v":1},{"$f":"'r'!J7","v":1},{"$f":"'r'!K7","v":2},{"$f":"'r'!L7","v":2},{"$f":"'r'!M7","v":2},{"$f":"'r'!N7","v":2},{"$f":"'r'!O7","v":1},{"$f":"'r'!P7","v":2},{"$f":"'r'!Q7","v":2},{"$f":"'r'!R7","v":2},{"$f":"'r'!S7","v":1},{"$f":"'r'!T7","v":2},{"$f":"'r'!U7","v":1},{"$f":"'r'!V7","v":1},{"$f":"'r'!W7","v":1},{"$f":"'r'!X7","v":2},{"$f":"'r'!Y7","v":1},{"$f":"'r'!Z7","v":2},{"$f":"'r'!AA7","v":2},{"$f":"'r'!AB7","v":2},{"$f":"'r'!AC7","v":1},{"$f":"'r'!AD7","v":2},{"$f":"'r'!AE7","v":2},{"$f":"'r'!AF7","v":2},6]
{"$rows_left_out":35}