{"text_format":"1","workbook":"xlsx","n_sheets":4,"sheets":["Start","1. Runde","2. Runde","3. Runde"],"not_rendered":{"charts":0,"images":1,"macros":1,"external_links":0,"defined_names":4,"comments":0,"pivot_tables":0},"unopened":[],"bounds":{"document_bytes":16777216,"sheet_cells":100000,"rows_first":2000,"rows_last":500,"rows_between":2000,"halvings":0,"cell_chars":16384,"cell_head_chars":4096},"cells_cut":0,"cells_raw":0,"read":"whole","date_system":"1900"}

{"sheet":"Start","index":0,"n_rows":43,"n_cols":15,"rows_kept":43,"cut":false,"hidden":false,"merged":[[27,2,27,4],[28,2,28,4],[1,7,3,8],[1,9,3,9],[18,10,19,14],[21,8,22,9],[11,1,11,2],[22,2,22,4],[30,2,30,4],[29,7,29,8],[30,7,30,8],[1,11,3,11],[21,11,22,13],[22,6,23,6],[27,9,28,9],[29,9,30,9],[27,7,27,8],[28,7,28,8],[29,2,29,4],[23,2,23,4],[22,5,23,5],[18,5,19,9],[26,2,26,4],[18,0,19,4]]}
[]
[null,null,"Schweizer Gruppenmeisterschaft",null,null,null,null,"Junioren /\nJuniors",null,"U10 - \nU17"]
[null,null,"Championnat suisse de groupes"]
[null,null,"Gewehr 10m / carabine 10m"]
[]
[]
[]
[]
[]
[]
[]
[null,"Name + Vorname                       Nom et prénom",null,"JG Année","Lizenz-Nr.   Licence no:",null,"Name + Vorname / Nom et prénom","JG Année","Lizenz-Nr.   Licence no:","Auswechselschütze tireurs remplaçants",null,"Name + Vorname / Nom et prénom","JG Année","Lizenz-Nr.   Licence no:","Auswechselschütze tireurs remplaçants"]
[null,null,null,null,null,null,null,null,null,{"$f":"COUNTIF(J14:J17,\"x\")","v":0},null,null,null,null,{"$f":"COUNTIF(O14:O17,\"x\")","v":0}]
[1,null,null,null,null,1,{"$f":"IF(ISBLANK(B14),\"\",B14)","v":""},{"$f":"IF(ISBLANK(D14),\"\",D14)","v":""},"",null,1,{"$f":"IF(ISBLANK(B14),\"\",B14)","v":""},{"$f":"IF(ISBLANK(D14),\"\",D14)","v":""},""]
[2,null,null,null,null,2,{"$f":"IF(ISBLANK(B15),\"\",B15)","v":""},"","",null,2,{"$f":"IF(ISBLANK(B15),\"\",B15)","v":""},"",""]
[3,null,null,null,null,3,{"$f":"IF(ISBLANK(B16),\"\",B16)","v":""},"","",null,3,{"$f":"IF(ISBLANK(B16),\"\",B16)","v":""},"",""]
[]
[]
[null,null,null,null,null,{"$f":"IF(J13>1,\"Achtung Es darf nur 1 Schützen pro Runde ausgewechselt werden!                                                   Attention, C'est permis de changer seulement 1 tireur!\",\" \")","v":" "},null,null,null,null,{"$f":"IF(O13>1,\"Achtung Es darf nur 1 Schützen pro Runde ausgewechselt werden!                                                   Attention, C'est permis de changer seulement 1 tireur!\",\" \")","v":" "}]
[]
[]
[null,null,null,null,null,"Gruppe Nr. / groupe no:",null,null,"Elektronische Scheiben/                     Cibles électronique:"]
["Verein/Société:"]
["Vereinsnummer",null,null,null,null,null,null,null,"Ja"]
[null,null,null,null,null,null,null,null,"Nein:"]
["Gruppenchef/chef du group:"]
["Name/Nome:"]
["Adresse/adresse:",null,null,null,null,null,null,"1. Karton Nr."]
["PLZ+Ort/lieu",null,null,null,null,null,null,"1. Carton-no:"]
["Tel./tél:",null,null,null,null,null,null,"Elektronisch:"]
["E-Mail:",null,null,null,null,null,null,"cibles électronique:"]
[]
["Erläuterungen / remarques:"]
[]
["Bei Auswechselschützen muss ein x in die entsprechende Spalte eingetragen werden"]
["Die Scheibenart muss mit einem x im entsprechenden Feld eingetragen werden"]
["Die erste Nummer der ausgeteilten Kartons ist im entsprechenden Feld einzutragen."]
["Die Scheiben müssen der Reihe nach verbraucht werden."]
[]
["Signalez les tireurs remplaçants par un x dans la colonne correspondante"]
["Placez un x dans la case correspondant au type de cibles."]
["Le numéro du 1er des cartons distribués doit figurer dans la casse prévue à cet effet"]
["Les cibles / feuilles de stand doivent être utilisées dans l'ordre de leur numérotation.",null,null,null,null,null,null,null," "]

{"sheet":"1. Runde","index":1,"n_rows":70,"n_cols":11,"rows_kept":70,"cut":false,"hidden":false,"merged":[[67,0,68,6],[67,7,69,7],[67,8,69,8],[67,10,69,10],[65,10,66,10],[61,6,62,6],[61,8,62,8],[61,10,62,10],[63,8,64,8],[64,1,64,3],[47,0,47,9],[20,8,22,8],[30,4,31,4],[57,6,58,6],[48,1,48,5],[55,0,58,0],[55,4,55,6],[55,8,56,8],[56,1,56,3],[63,0,66,0],[63,4,63,6],[64,4,64,6],[65,1,66,1],[65,2,66,2],[65,8,66,8],[65,3,66,3],[65,4,66,4],[65,5,66,5],[65,6,66,6],[59,0,62,0],[59,4,59,6],[59,8,60,8],[60,1,60,3],[60,4,60,6],[61,1,62,1],[61,2,62,2],[61,3,62,3],[61,4,62,4],[61,5,62,5],[56,4,56,6],[57,1,58,1],[57,2,58,2],[57,8,58,8],[57,4,58,4],[57,5,58,5],[57,10,58,10],[53,6,54,6],[53,8,54,8],[53,10,54,10],[57,3,58,3],[50,0,50,1],[50,2,50,3],[50,4,50,6],[50,8,50,10],[48,6,48,7],[49,0,49,1],[49,2,49,5],[49,7,49,8],[51,0,54,0],[51,4,51,6],[51,8,52,8],[52,1,52,3],[52,4,52,6],[53,1,54,1],[53,2,54,2],[53,3,54,3],[53,4,54,4],[53,5,54,5],[13,1,13,3],[18,3,19,3],[16,0,19,0],[10,3,11,3],[17,1,17,3],[12,0,15,0],[14,1,15,1],[14,2,15,2],[14,3,15,3],[6,6,7,6],[8,4,8,6],[5,1,5,3],[9,1,9,3],[8,0,11,0],[6,1,7,1],[6,2,7,2],[10,2,11,2],[4,0,7,0],[5,4,5,6],[18,2,19,2],[24,0,24,9],[20,10,22,10],[6,4,7,4],[6,5,7,5],[2,0,2,1],[1,6,1,7],[1,1,1,5],[2,2,2,5],[9,4,9,6],[10,1,11,1],[10,6,11,6],[4,4,4,6],[6,3,7,3],[3,0,3,1],[2,7,2,8],[3,8,3,10],[3,2,3,3],[3,4,3,6],[10,4,11,4],[13,4,13,6],[12,4,12,6],[10,5,11,5],[44,10,46,10],[40,0,43,0],[40,4,40,6],[41,1,41,3],[42,10,43,10],[42,8,43,8],[42,2,43,2],[42,3,43,3],[44,7,46,7],[44,8,46,8],[44,0,45,6],[42,1,43,1],[26,0,26,1],[27,0,27,1],[26,7,26,8],[26,2,26,5],[42,4,43,4],[42,5,43,5],[42,6,43,6],[27,8,27,10],[38,1,39,1],[38,5,39,5],[38,6,39,6],[29,4,29,6],[30,1,31,1],[30,2,31,2],[30,3,31,3],[30,5,31,5],[30,6,31,6],[29,1,29,3],[32,0,35,0],[32,4,32,6],[33,1,33,3],[33,4,33,6],[34,1,35,1],[18,10,19,10],[41,4,41,6],[40,8,41,8],[38,10,39,10],[28,8,29,8],[20,0,21,6],[34,3,35,3],[34,4,35,4],[34,5,35,5],[34,6,35,6],[34,2,35,2],[25,1,25,5],[25,6,25,7],[20,7,22,7],[18,1,19,1],[28,4,28,6],[27,2,27,3],[27,4,27,6],[18,6,19,6],[22,4,22,6],[34,10,35,10],[34,8,35,8],[30,8,31,8],[30,10,31,10],[36,8,37,8],[14,8,15,8],[18,8,19,8],[36,0,39,0],[36,4,36,6],[37,1,37,3],[37,4,37,6],[38,2,39,2],[38,3,39,3],[38,4,39,4],[14,4,15,4],[14,5,15,5],[14,6,15,6],[28,0,31,0],[32,8,33,8],[38,8,39,8],[18,4,19,4],[18,5,19,5],[16,4,16,6],[17,4,17,6],[16,8,17,8],[6,10,7,10],[10,10,11,10],[14,10,15,10],[10,8,11,8],[4,8,5,8],[6,8,7,8],[8,8,9,8],[12,8,13,8]]}
[null,null,null,null,null,null,null,null,null,null,"Junioren /\nJuniors U10-U17"]
["Verein: Sociéte:",{"$f":"Start!C23","v":0},null,null,null,null,"Vereinsnummer: Société No:",null,{"$f":"Start!C24","v":0},"Runde: Tour:",1]
["Funktionär: Responsable:",null,{"$f":"Start!C27","v":0},null,null,null,"Tel. / Tél:",{"$f":"Start!C30","v":0},null,"Gruppe:Groupe:",{"$f":"Start!F23","v":0}]
["Strasse, PLZ, Ort: rue, NPA, lieu:",null,{"$f":"Start!C28","v":0},null,{"$f":"Start!C29","v":0},null,null,"E-Mail:",{"$f":"Start!C31","v":0}]
[1,"Name, Nom:",null,null,"Lizenz Nr./Licence no:",null,null,null,"Resultat  Résultat",null,"Kontrolle"]
[null,{"$f":"Start!B14","v":0},null,null,{"$f":"Start!E14","v":0},null,null,null,null,null,"Contrôle"]
[null,"Jg: Année",{"$f":"Start!D14","v":0},{"$f":"IF(Start!J25=\"x\",\"Karton Nr. Carton-no\",\"Elektronisch életronique\")","v":"Elektronisch életronique"},{"$f":"IF(Start!J25=\"x\",Start!J28,Start!J30)","v":0},"-",{"$f":"IF(Start!J25=\"x\",'1. Runde'!E7:E8+3,E7)","v":0},null,{"$f":"SUM(H5:H8)","v":0}]
[]
[2,"Name, Nom:",null,null,"Lizenz Nr./Licence no:",null,null,null,"Resultat  Résultat",null,"Kontrolle"]
[null,{"$f":"Start!B15","v":0},null,null,{"$f":"Start!E15","v":0},null,null,null,null,null,"Contrôle"]
[null,"Jg: Année",{"$f":"Start!D15","v":0},{"$f":"IF(Start!J25=\"x\",\"Karton Nr. Carton-no\",\"Elektronisch életronique\")","v":"Elektronisch életronique"},{"$f":"G7+1","v":1},"-",{"$f":"IF(Start!J25=\"x\",'1. Runde'!E11:E12+3,E11)","v":1},null,{"$f":"SUM(H9:H12)","v":0}]
[]
[3,"Name, Nom:",null,null,"Lizenz Nr./Licence no:",null,null,null,"Resultat  Résultat",null,"Kontrolle"]
[null,{"$f":"Start!B16","v":0},null,null,{"$f":"Start!E16","v":0},null,null,null,null,null,"Contrôle"]
[null,"Jg: Année",{"$f":"Start!D16","v":0},{"$f":"IF(Start!J25=\"x\",\"Karton Nr. Carton-no\",\"Elektronisch életronique\")","v":"Elektronisch életronique"},{"$f":"G11+1","v":2},"-",{"$f":"IF(Start!J25=\"x\",'1. Runde'!E15:E16+3,E15)","v":2},null,{"$f":"SUM(H13:H16)","v":0}]
[]
[null,"Name, Nom:",null,null,"Lizenz Nr./Licence no:",null,null,null,"Resultat  Résultat",null,"Kontrolle"]
[null,{"$f":"Start!B17","v":0},null,null,{"$f":"Start!E17","v":0},null,null,null,null,null,"Contrôle"]
[null,"Jg: Année",{"$f":"Start!D17","v":0},{"$f":"IF(Start!J25=\"x\",\"Karton Nr. Carton-no\",\"Elektronisch életronique\")","v":"Elektronisch életronique"},null,"-",null,null,{"$f":"SUM(H17:H20)","v":0}]
[]
["Die aufgeführten Schützen sind lizenzierte Mitglieder unseres Vereins. Sie haben Vorschrifts- gemäss geschossen.  Les tireurs inscripts sont membres licenciés de notre société. Ils ont tiré confoormément aux prescriptions.",null,null,null,null,null,null,"Total",{"$f":"SUM(I7+I11+I15+I19)","v":0}]
[]
["Der Kontrolleur / Le Contrôleur:"]
[]
["Gruppenmeisterschaft SSV Gewehr 10m\nChampionnant de groupes SSV carabine 10m",null,null,null,null,null,null,null,null,null,{"$f":"K1","v":"Junioren /\nJuniors U10-U17"}]
["Verein: Sociéte:",{"$f":"B2","v":0},null,null,null,null,"Vereinsnummer: Société No:",null,{"$f":"I2","v":0},"Runde: Tour:",{"$f":"K2","v":1}]
["Funktionär: Responsable:",null,{"$f":"C3","v":0},null,null,null,"Tel. / Tél:",{"$f":"H3","v":0},null,"Gruppe:Groupe:",{"$f":"K3","v":0}]
["Strasse, PLZ, Ort: rue, NPA, lieu:",null,{"$f":"C4","v":0},null,{"$f":"E4","v":0},null,null,{"$f":"H4","v":"E-Mail:"},{"$f":"I4","v":0}]
[1,"Name, Nom:",null,null,"Lizenz Nr./Licence no:",null,null,{"$f":"H5","v":0},"Resultat  Résultat",null,"Kontrolle"]
[null,{"$f":"B6","v":0},null,null,{"$f":"E6","v":0},null,null,{"$f":"H6","v":0},null,null,"Contrôle"]
[null,"Jg: Année",{"$f":"C7","v":0},{"$f":"D7","v":"Elektronisch életronique"},{"$f":"E7","v":0},"-",{"$f":"G7","v":0},0,{"$f":"I7","v":0}]
[null,null,null,null,null,null,null,0]
[2,"Name, Nom:",null,null,"Lizenz Nr./Licence no:",null,null,0,"Resultat  Résultat",null,"Kontrolle"]
[null,{"$f":"B10","v":0},null,null,{"$f":"E10","v":0},null,null,0,null,null,"Contrôle"]
[null,"Jg: Année",{"$f":"C11","v":0},{"$f":"D11","v":"Elektronisch életronique"},{"$f":"E11","v":1},"-",{"$f":"G11","v":1},0,{"$f":"I11","v":0}]
[null,null,null,null,null,null,null,0]
[3,"Name, Nom:",null,null,"Lizenz Nr./Licence no:",null,null,0,"Resultat  Résultat",null,"Kontrolle"]
[null,{"$f":"B14","v":0},null,null,{"$f":"E14","v":0},null,null,0,null,null,"Contrôle"]
[null,"Jg: Année",{"$f":"C15","v":0},{"$f":"D15","v":"Elektronisch életronique"},{"$f":"E15","v":2},"-",{"$f":"G15","v":2},0,{"$f":"I15","v":0}]
[null,null,null,null,null,null,null,0]
[null,"Name, Nom:",null,null,"Lizenz Nr./Licence no:",null,null,0,"Resultat  Résultat",null,"Kontrolle"]
[null,{"$f":"B18","v":0},null,null,{"$f":"E18","v":0},null,null,0,null,null,"Contrôle"]
[null,"Jg: Année",{"$f":"C19","v":0},{"$f":"D19","v":"Elektronisch életronique"},null,"-",null,0,{"$f":"I19","v":0}]
[null,null,null,null,null,null,null,0]
["Die aufgeführten Schützen sind lizenzierte Mitglieder unseres Vereins. Sie haben Vorschrifts- gemäss geschossen.  Les tireurs inscripts sont membres licenciés de notre société. Ils ont tiré confoormément aux prescriptions.",null,null,null,null,null,null,"Total",{"$f":"I21","v":0}]
[]
["Der Kontrolleur / Le Contrôleur:",null,null,null,{"$f":"E23","v":0}]
["Gruppenmeisterschaft SSV Gewehr 10m\nChampionnant de groupes SSV carabine 10m",null,null,null,null,null,null,null,null,null,{"$f":"K1","v":"Junioren /\nJuniors U10-U17"}]
["Verein: Sociéte:",{"$f":"B26","v":0},null,null,null,null,"Vereinsnummer: Société No:",null,{"$f":"I26","v":0},"Runde: Tour:",{"$f":"K26","v":1}]
["Funktionär: Responsable:",null,{"$f":"C27","v":0},null,null,null,"Tel. / Tél:",{"$f":"H27","v":0},null,"Gruppe:Groupe:",{"$f":"K27","v":0}]
["Strasse, PLZ, Ort: rue, NPA, lieu:",null,{"$f":"C28","v":0},null,{"$f":"E28","v":0},null,null,{"$f":"H28","v":"E-Mail:"},{"$f":"I28","v":0}]
[1,"Name, Nom:",null,null,"Lizenz Nr./Licence no:",null,null,{"$f":"H29","v":0},"Resultat  Résultat",null,"Kontrolle"]
[null,{"$f":"B30","v":0},null,null,{"$f":"E30","v":0},null,null,{"$f":"H30","v":0},null,null,"Contrôle"]
[null,"Jg: Année",{"$f":"C31","v":0},{"$f":"D31","v":"Elektronisch életronique"},{"$f":"E31","v":0},"-",{"$f":"G31","v":0},0,{"$f":"I31","v":0}]
[null,null,null,null,null,null,null,0]
[2,"Name, Nom:",null,null,"Lizenz Nr./Licence no:",null,null,0,"Resultat  Résultat",null,"Kontrolle"]
[null,{"$f":"B34","v":0},null,null,{"$f":"E34","v":0},null,null,0,null,null,"Contrôle"]
[null,"Jg: Année",{"$f":"C35","v":0},{"$f":"D35","v":"Elektronisch életronique"},{"$f":"E35","v":1},"-",{"$f":"G35","v":1},0,{"$f":"I35","v":0}]
[null,null,null,null,null,null,null,0]
[3,"Name, Nom:",null,null,"Lizenz Nr./Licence no:",null,null,0,"Resultat  Résultat",null,"Kontrolle"]
[null,{"$f":"B38","v":0},null,null,{"$f":"E38","v":0},null,null,0,null,null,"Contrôle"]
[null,"Jg: Année",{"$f":"C39","v":0},{"$f":"D39","v":"Elektronisch életronique"},{"$f":"E39","v":2},"-",{"$f":"G39","v":2},0,{"$f":"I39","v":0}]
[null,null,null,null,null,null,null,0]
[null,"Name, Nom:",null,null,"Lizenz Nr./Licence no:",null,null,0,"Resultat  Résultat",null,"Kontrolle"]
[null,{"$f":"B42","v":0},null,null,{"$f":"E42","v":0},null,null,0,null,null,"Contrôle"]
[null,"Jg: Année",{"$f":"C43","v":0},{"$f":"D43","v":"Elektronisch életronique"},null,"-",null,0,{"$f":"I43","v":0}]
[null,null,null,null,null,null,null,0]
["Die aufgeführten Schützen sind lizenzierte Mitglieder unseres Vereins. Sie haben Vorschrifts- gemäss geschossen.  Les tireurs inscripts sont membres licenciés de notre société. Ils ont tiré confoormément aux prescriptions.",null,null,null,null,null,null,"Total",{"$f":"I45","v":0}]
[]
["Der Kontrolleur / Le Contrôleur:",null,null,null,{"$f":"E47","v":0}]

{"sheet":"2. Runde","index":2,"n_rows":70,"n_cols":11,"rows_kept":70,"cut":false,"hidden":false,"merged":[[3,0,3,1],[3,2,3,3],[3,4,3,6],[3,8,3,10],[1,1,1,5],[1,6,1,7],[2,0,2,1],[2,2,2,5],[2,7,2,8],[6,6,7,6],[6,8,7,8],[6,10,7,10],[8,0,11,0],[8,4,8,6],[8,8,9,8],[9,1,9,3],[9,4,9,6],[10,1,11,1],[10,2,11,2],[4,0,7,0],[4,4,4,6],[4,8,5,8],[5,1,5,3],[5,4,5,6],[6,1,7,1],[6,2,7,2],[6,3,7,3],[6,4,7,4],[6,5,7,5],[14,6,15,6],[14,8,15,8],[10,8,11,8],[10,10,11,10],[14,10,15,10],[16,0,19,0],[16,4,16,6],[16,8,17,8],[17,1,17,3],[17,4,17,6],[12,0,15,0],[12,4,12,6],[12,8,13,8],[13,1,13,3],[13,4,13,6],[14,1,15,1],[14,2,15,2],[14,3,15,3],[14,4,15,4],[14,5,15,5],[10,3,11,3],[10,4,11,4],[10,5,11,5],[10,6,11,6],[20,8,22,8],[20,10,22,10],[22,4,22,6],[18,5,19,5],[18,6,19,6],[18,8,19,8],[18,10,19,10],[18,1,19,1],[18,2,19,2],[18,3,19,3],[18,4,19,4],[20,0,21,6],[20,7,22,7],[27,0,27,1],[27,2,27,3],[27,4,27,6],[27,8,27,10],[24,0,24,9],[25,1,25,5],[25,6,25,7],[26,0,26,1],[26,2,26,5],[26,7,26,8],[30,6,31,6],[30,8,31,8],[30,10,31,10],[32,0,35,0],[32,4,32,6],[32,8,33,8],[33,1,33,3],[33,4,33,6],[34,1,35,1],[34,2,35,2],[28,0,31,0],[28,4,28,6],[28,8,29,8],[29,1,29,3],[29,4,29,6],[30,1,31,1],[30,2,31,2],[30,3,31,3],[30,4,31,4],[30,5,31,5],[38,6,39,6],[38,8,39,8],[34,8,35,8],[34,10,35,10],[38,10,39,10],[40,0,43,0],[40,4,40,6],[40,8,41,8],[41,1,41,3],[41,4,41,6],[36,0,39,0],[36,4,36,6],[36,8,37,8],[37,1,37,3],[37,4,37,6],[38,1,39,1],[38,2,39,2],[38,3,39,3],[38,4,39,4],[38,5,39,5],[34,3,35,3],[34,4,35,4],[34,5,35,5],[34,6,35,6],[42,5,43,5],[42,6,43,6],[42,8,43,8],[42,10,43,10],[42,1,43,1],[42,2,43,2],[42,3,43,3],[42,4,43,4],[44,0,45,6],[44,7,46,7],[50,8,50,10],[47,0,47,9],[48,1,48,5],[48,6,48,7],[49,0,49,1],[49,2,49,5],[49,7,49,8],[44,8,46,8],[44,10,46,10],[52,4,52,6],[53,1,54,1],[53,2,54,2],[53,3,54,3],[53,4,54,4],[53,5,54,5],[50,0,50,1],[50,2,50,3],[50,4,50,6],[53,6,54,6],[53,8,54,8],[53,10,54,10],[59,0,62,0],[59,4,59,6],[59,8,60,8],[60,1,60,3],[60,4,60,6],[61,1,62,1],[61,2,62,2],[55,0,58,0],[55,4,55,6],[55,8,56,8],[56,1,56,3],[56,4,56,6],[57,1,58,1],[57,2,58,2],[57,3,58,3],[57,4,58,4],[57,5,58,5],[51,0,54,0],[51,4,51,6],[51,8,52,8],[52,1,52,3],[61,6,62,6],[61,8,62,8],[57,8,58,8],[57,10,58,10],[61,10,62,10],[57,6,58,6],[61,3,62,3],[61,4,62,4],[61,5,62,5],[67,0,68,6],[67,7,69,7],[67,8,69,8],[67,10,69,10],[65,1,66,1],[65,2,66,2],[65,3,66,3],[65,4,66,4],[65,5,66,5],[65,6,66,6],[65,8,66,8],[65,10,66,10],[63,0,66,0],[63,4,63,6],[63,8,64,8],[64,1,64,3],[64,4,64,6]]}
[null,null,null,null,null,null,null,null,null,null,"Junioren /\nJuniors U10-U17"]
["Verein: Sociéte:",{"$f":"Start!C23","v":0},null,null,null,null,"Vereinsnummer: Société No:",null,{"$f":"Start!C24","v":0},"Runde: Tour:",2]
["Funktionär: Responsable:",null,{"$f":"Start!C27","v":0},null,null,null,"Tel. / Tél:",{"$f":"Start!C30","v":0},null,"Gruppe:Groupe:",{"$f":"Start!F23","v":0}]
["Strasse, PLZ, Ort: rue, NPA, lieu:",null,{"$f":"Start!C28","v":0},null,{"$f":"Start!C29","v":0},null,null,"E-Mail:",{"$f":"Start!C31","v":0}]
[1,"Name, Nom:",null,{"$f":"IF(Start!J14=\"x\",\"ausgewechselt\", \" \")","v":" "},"Lizenz Nr./Licence no:",null,null,null,"Resultat  Résultat",null,"Kontrolle"]
[null,{"$f":"Start!G14","v":""},null,null,{"$f":"Start!I14","v":""},null,null,null,null,null,"Contrôle"]
[null,"Jg: Année",{"$f":"Start!H14","v":""},{"$f":"IF(Start!J25=\"x\",\"Karton Nr. Carton-no\",\"Elektronisch életronique\")","v":"Elektronisch életronique"},{"$f":"IF(Start!J25=\"x\",(Start!J28+12),Start!J30+3)","v":3},"-",{"$f":"IF(Start!J25=\"x\",'2. Runde'!E7:E8+3,E7)","v":3},null,{"$f":"SUM(H5:H8)","v":0}]
[]
[2,"Name, Nom:",null,{"$f":"IF(Start!J15=\"x\",\"ausgewechselt\",\" \")","v":" "},"Lizenz Nr./Licence no:",null,null,null,"Resultat  Résultat",null,"Kontrolle"]
[null,{"$f":"Start!G15","v":""},null,null,{"$f":"Start!I15","v":""},null,null,null,null,null,"Contrôle"]
[null,"Jg: Année",{"$f":"Start!H15","v":""},{"$f":"IF(Start!J25=\"x\",\"Karton Nr. Carton-no\",\"Elektronisch életronique\")","v":"Elektronisch életronique"},{"$f":"G7+1","v":4},"-",{"$f":"IF(Start!J25=\"x\",'2. Runde'!E11:E12+3,E11)","v":4},null,{"$f":"SUM(H9:H12)","v":0}]
[]
[3,"Name, Nom:",null,{"$f":"IF(Start!J16=\"x\",\"ausgewechselt\", \" \")","v":" "},"Lizenz Nr./Licence no:",null,null,null,"Resultat  Résultat",null,"Kontrolle"]
[null,{"$f":"Start!G16","v":""},null,null,{"$f":"Start!I16","v":""},null,null,null,null,null,"Contrôle"]
[null,"Jg: Année",{"$f":"Start!H16","v":""},{"$f":"IF(Start!J25=\"x\",\"Karton Nr. Carton-no\",\"Elektronisch életronique\")","v":"Elektronisch életronique"},{"$f":"G11+1","v":5},"-",{"$f":"IF(Start!J25=\"x\",'2. Runde'!E15:E16+3,E15)","v":5},null,{"$f":"SUM(H13:H16)","v":0}]
[]
[null,"Name, Nom:",null,{"$f":"IF(Start!J17=\"x\",\"ausgewechselt\", \" \")","v":" "},"Lizenz Nr./Licence no:",null,null,null,"Resultat  Résultat",null,"Kontrolle"]
[null,{"$f":"Start!G17","v":0},null,null,{"$f":"Start!I17","v":0},null,null,null,null,null,"Contrôle"]
[null,"Jg: Année",{"$f":"Start!H17","v":0},{"$f":"IF(Start!J25=\"x\",\"Karton Nr. Carton-no\",\"Elektronisch életronique\")","v":"Elektronisch életronique"},null,"-",null,null,{"$f":"SUM(H17:H20)","v":0}]
[]
["Die aufgeführten Schützen sind lizenzierte Mitglieder unseres Vereins. Sie haben Vorschrifts- gemäss geschossen.  Les tireurs inscripts sont membres licenciés de notre société. Ils ont tiré confoormément aux prescriptions.",null,null,null,null,null,null,"Total",{"$f":"SUM(I7+I11+I15+I19)","v":0}]
[]
["Der Kontrolleur / Le Contrôleur:"]
[]
["Gruppenmeisterschaft SSV Gewehr 10m\nChampionnant de groupes SSV carabine 10m",null,null,null,null,null,null,null,null,null,{"$f":"K1","v":"Junioren /\nJuniors U10-U17"}]
["Verein: Sociéte:",{"$f":"B2","v":0},null,null,null,null,"Vereinsnummer: Société No:",null,{"$f":"I2","v":0},"Runde: Tour:",{"$f":"K2","v":2}]
["Funktionär: Responsable:",null,{"$f":"C3","v":0},null,null,null,"Tel. / Tél:",{"$f":"H3","v":0},null,"Gruppe:Groupe:",{"$f":"K3","v":0}]
["Strasse, PLZ, Ort: rue, NPA, lieu:",null,{"$f":"C4","v":0},null,{"$f":"E4","v":0},null,null,{"$f":"H4","v":"E-Mail:"},{"$f":"I4","v":0}]
[1,"Name, Nom:",null,{"$f":"D5","v":" "},"Lizenz Nr./Licence no:",null,null,{"$f":"H5","v":0},"Resultat  Résultat",null,"Kontrolle"]
[null,{"$f":"B6","v":""},null,null,{"$f":"E6","v":""},null,null,{"$f":"H6","v":0},null,null,"Contrôle"]
[null,"Jg: Année",{"$f":"C7","v":""},{"$f":"D7","v":"Elektronisch életronique"},{"$f":"E7","v":3},"-",{"$f":"G7","v":3},0,{"$f":"I7","v":0}]
[null,null,null,null,null,null,null,0]
[2,"Name, Nom:",null,{"$f":"D9","v":" "},"Lizenz Nr./Licence no:",null,null,0,"Resultat  Résultat",null,"Kontrolle"]
[null,{"$f":"B10","v":""},null,null,{"$f":"E10","v":""},null,null,0,null,null,"Contrôle"]
[null,"Jg: Année",{"$f":"C11","v":""},{"$f":"D11","v":"Elektronisch életronique"},{"$f":"E11","v":4},"-",{"$f":"G11","v":4},0,{"$f":"I11","v":0}]
[null,null,null,null,null,null,null,0]
[3,"Name, Nom:",null,{"$f":"D13","v":" "},"Lizenz Nr./Licence no:",null,null,0,"Resultat  Résultat",null,"Kontrolle"]
[null,{"$f":"B14","v":""},null,null,{"$f":"E14","v":""},null,null,0,null,null,"Contrôle"]
[null,"Jg: Année",{"$f":"C15","v":""},{"$f":"D15","v":"Elektronisch életronique"},{"$f":"E15","v":5},"-",{"$f":"G15","v":5},0,{"$f":"I15","v":0}]
[null,null,null,null,null,null,null,0]
[null,"Name, Nom:",null,{"$f":"D17","v":" "},"Lizenz Nr./Licence no:",null,null,0,"Resultat  Résultat",null,"Kontrolle"]
[null,{"$f":"B18","v":0},null,null,{"$f":"E18","v":0},null,null,0,null,null,"Contrôle"]
[null,"Jg: Année",{"$f":"C19","v":0},{"$f":"D19","v":"Elektronisch életronique"},null,"-",null,0,{"$f":"I19","v":0}]
[null,null,null,null,null,null,null,0]
["Die aufgeführten Schützen sind lizenzierte Mitglieder unseres Vereins. Sie haben Vorschrifts- gemäss geschossen.  Les tireurs inscripts sont membres licenciés de notre société. Ils ont tiré confoormément aux prescriptions.",null,null,null,null,null,null,"Total",{"$f":"I21","v":0}]
[]
["Der Kontrolleur / Le Contrôleur:",null,null,null,{"$f":"E23","v":0}]
["Gruppenmeisterschaft SSV Gewehr 10m\nChampionnant de groupes SSV carabine 10m",null,null,null,null,null,null,null,null,null,{"$f":"K25","v":"Junioren /\nJuniors U10-U17"}]
["Verein: Sociéte:",{"$f":"B26","v":0},null,null,null,null,"Vereinsnummer: Société No:",null,{"$f":"I26","v":0},"Runde: Tour:",{"$f":"K26","v":2}]
["Funktionär: Responsable:",null,{"$f":"C27","v":0},null,null,null,"Tel. / Tél:",{"$f":"H27","v":0},null,"Gruppe:Groupe:",{"$f":"K27","v":0}]
["Strasse, PLZ, Ort: rue, NPA, lieu:",null,{"$f":"C28","v":0},null,{"$f":"E28","v":0},null,null,{"$f":"H28","v":"E-Mail:"},{"$f":"I28","v":0}]
[1,"Name, Nom:",null,{"$f":"D29","v":" "},"Lizenz Nr./Licence no:",null,null,{"$f":"H29","v":0},"Resultat  Résultat",null,"Kontrolle"]
[null,{"$f":"B30","v":""},null,null,{"$f":"E30","v":""},null,null,{"$f":"H30","v":0},null,null,"Contrôle"]
[null,"Jg: Année",{"$f":"C31","v":""},{"$f":"D31","v":"Elektronisch életronique"},{"$f":"E31","v":3},"-",{"$f":"G31","v":3},0,{"$f":"I31","v":0}]
[null,null,null,null,null,null,null,0]
[2,"Name, Nom:",null,{"$f":"D33","v":" "},"Lizenz Nr./Licence no:",null,null,0,"Resultat  Résultat",null,"Kontrolle"]
[null,{"$f":"B34","v":""},null,null,{"$f":"E34","v":""},null,null,0,null,null,"Contrôle"]
[null,"Jg: Année",{"$f":"C35","v":""},{"$f":"D35","v":"Elektronisch életronique"},{"$f":"E35","v":4},"-",{"$f":"G35","v":4},0,{"$f":"I35","v":0}]
[null,null,null,null,null,null,null,0]
[3,"Name, Nom:",null,{"$f":"D37","v":" "},"Lizenz Nr./Licence no:",null,null,0,"Resultat  Résultat",null,"Kontrolle"]
[null,{"$f":"B38","v":""},null,null,{"$f":"E38","v":""},null,null,0,null,null,"Contrôle"]
[null,"Jg: Année",{"$f":"C39","v":""},{"$f":"D39","v":"Elektronisch életronique"},{"$f":"E39","v":5},"-",{"$f":"G39","v":5},0,{"$f":"I39","v":0}]
[null,null,null,null,null,null,null,0]
[null,"Name, Nom:",null,{"$f":"D41","v":" "},"Lizenz Nr./Licence no:",null,null,0,"Resultat  Résultat",null,"Kontrolle"]
[null,{"$f":"B42","v":0},null,null,{"$f":"E42","v":0},null,null,0,null,null,"Contrôle"]
[null,"Jg: Année",{"$f":"C43","v":0},{"$f":"D43","v":"Elektronisch életronique"},null,"-",null,0,{"$f":"I43","v":0}]
[null,null,null,null,null,null,null,0]
["Die aufgeführten Schützen sind lizenzierte Mitglieder unseres Vereins. Sie haben Vorschrifts- gemäss geschossen.  Les tireurs inscripts sont membres licenciés de notre société. Ils ont tiré confoormément aux prescriptions.",null,null,null,null,null,null,"Total",{"$f":"I45","v":0}]
[]
["Der Kontrolleur / Le Contrôleur:",null,null,null,{"$f":"E47","v":0}]

{"sheet":"3. Runde","index":3,"n_rows":70,"n_cols":11,"rows_kept":70,"cut":false,"hidden":false,"merged":[[3,0,3,1],[3,2,3,3],[3,4,3,6],[3,8,3,10],[1,1,1,5],[1,6,1,7],[2,0,2,1],[2,2,2,5],[2,7,2,8],[6,6,7,6],[6,8,7,8],[6,10,7,10],[8,0,11,0],[8,4,8,6],[8,8,9,8],[9,1,9,3],[9,4,9,6],[10,1,11,1],[10,2,11,2],[4,0,7,0],[4,4,4,6],[4,8,5,8],[5,1,5,3],[5,4,5,6],[6,1,7,1],[6,2,7,2],[6,3,7,3],[6,4,7,4],[6,5,7,5],[14,6,15,6],[14,8,15,8],[10,8,11,8],[10,10,11,10],[14,10,15,10],[16,0,19,0],[16,4,16,6],[16,8,17,8],[17,1,17,3],[17,4,17,6],[12,0,15,0],[12,4,12,6],[12,8,13,8],[13,1,13,3],[13,4,13,6],[14,1,15,1],[14,2,15,2],[14,3,15,3],[14,4,15,4],[14,5,15,5],[10,3,11,3],[10,4,11,4],[10,5,11,5],[10,6,11,6],[20,8,22,8],[20,10,22,10],[22,4,22,6],[18,5,19,5],[18,6,19,6],[18,8,19,8],[18,10,19,10],[18,1,19,1],[18,2,19,2],[18,3,19,3],[18,4,19,4],[20,0,21,6],[20,7,22,7],[27,0,27,1],[27,2,27,3],[27,4,27,6],[27,8,27,10],[24,0,24,9],[25,1,25,5],[25,6,25,7],[26,0,26,1],[26,2,26,5],[26,7,26,8],[30,6,31,6],[30,8,31,8],[30,10,31,10],[32,0,35,0],[32,4,32,6],[32,8,33,8],[33,1,33,3],[33,4,33,6],[34,1,35,1],[34,2,35,2],[28,0,31,0],[28,4,28,6],[28,8,29,8],[29,1,29,3],[29,4,29,6],[30,1,31,1],[30,2,31,2],[30,3,31,3],[30,4,31,4],[30,5,31,5],[38,6,39,6],[38,8,39,8],[34,8,35,8],[34,10,35,10],[38,10,39,10],[40,0,43,0],[40,4,40,6],[40,8,41,8],[41,1,41,3],[41,4,41,6],[36,0,39,0],[36,4,36,6],[36,8,37,8],[37,1,37,3],[37,4,37,6],[38,1,39,1],[38,2,39,2],[38,3,39,3],[38,4,39,4],[38,5,39,5],[34,3,35,3],[34,4,35,4],[34,5,35,5],[34,6,35,6],[42,5,43,5],[42,6,43,6],[42,8,43,8],[42,10,43,10],[42,1,43,1],[42,2,43,2],[42,3,43,3],[42,4,43,4],[44,0,45,6],[44,7,46,7],[50,8,50,10],[47,0,47,9],[48,1,48,5],[48,6,48,7],[49,0,49,1],[49,2,49,5],[49,7,49,8],[44,8,46,8],[44,10,46,10],[52,4,52,6],[53,1,54,1],[53,2,54,2],[53,3,54,3],[53,4,54,4],[53,5,54,5],[50,0,50,1],[50,2,50,3],[50,4,50,6],[53,6,54,6],[53,8,54,8],[53,10,54,10],[59,0,62,0],[59,4,59,6],[59,8,60,8],[60,1,60,3],[60,4,60,6],[61,1,62,1],[61,2,62,2],[55,0,58,0],[55,4,55,6],[55,8,56,8],[56,1,56,3],[56,4,56,6],[57,1,58,1],[57,2,58,2],[57,3,58,3],[57,4,58,4],[57,5,58,5],[51,0,54,0],[51,4,51,6],[51,8,52,8],[52,1,52,3],[61,6,62,6],[61,8,62,8],[57,8,58,8],[57,10,58,10],[61,10,62,10],[57,6,58,6],[61,3,62,3],[61,4,62,4],[61,5,62,5],[67,0,68,6],[67,7,69,7],[67,8,69,8],[67,10,69,10],[65,1,66,1],[65,2,66,2],[65,3,66,3],[65,4,66,4],[65,5,66,5],[65,6,66,6],[65,8,66,8],[65,10,66,10],[63,0,66,0],[63,4,63,6],[63,8,64,8],[64,1,64,3],[64,4,64,6]]}
[null,null,null,null,null,null,null,null,null,null,"Junioren /\nJuniors U10-U17"]
["Verein: Sociéte:",{"$f":"Start!C23","v":0},null,null,null,null,"Vereinsnummer: Société No:",null,{"$f":"Start!C24","v":0},"Runde: Tour:",3]
["Funktionär: Responsable:",null,{"$f":"Start!C27","v":0},null,null,null,"Tel. / Tél:",{"$f":"Start!C30","v":0},null,"Gruppe:Groupe:",{"$f":"Start!F23","v":0}]
["Strasse, PLZ, Ort: rue, NPA, lieu:",null,{"$f":"Start!C28","v":0},null,{"$f":"Start!C29","v":0},null,null,"E-Mail:",{"$f":"Start!C31","v":0}]
[1,"Name, Nom:",null,{"$f":"IF(Start!O14=\"x\",\"ausgewechselt\", \" \")","v":" "},"Lizenz Nr./Licence no:",null,null,null,"Resultat  Résultat",null,"Kontrolle"]
[null,{"$f":"Start!L14","v":""},null,null,{"$f":"Start!N14","v":""},null,null,null,null,null,"Contrôle"]
[null,"Jg: Année",{"$f":"Start!M14","v":""},{"$f":"IF(Start!J25=\"x\",\"Karton Nr. Carton-no\",\"Elektronisch életronique\")","v":"Elektronisch életronique"},{"$f":"IF(Start!J25=\"x\",(Start!J28+24),Start!J30+6)","v":6},"-",{"$f":"IF(Start!J25=\"x\",'3. Runde'!E7:E8+3,E7)","v":6},null,{"$f":"SUM(H5:H8)","v":0}]
[]
[2,"Name, Nom:",null,{"$f":"IF(Start!O15=\"x\",\"ausgewechselt\",\" \")","v":" "},"Lizenz Nr./Licence no:",null,null,null,"Resultat  Résultat",null,"Kontrolle"]
[null,{"$f":"Start!L15","v":""},null,null,{"$f":"Start!N15","v":""},null,null,null,null,null,"Contrôle"]
[null,"Jg: Année",{"$f":"Start!M15","v":""},{"$f":"IF(Start!J25=\"x\",\"Karton Nr. Carton-no\",\"Elektronisch életronique\")","v":"Elektronisch életronique"},{"$f":"G7+1","v":7},"-",{"$f":"IF(Start!J25=\"x\",'3. Runde'!E11:E12+3,E11)","v":7},null,{"$f":"SUM(H9:H12)","v":0}]
[]
[3,"Name, Nom:",null,{"$f":"IF(Start!O16=\"x\",\"ausgewechselt\", \" \")","v":" "},"Lizenz Nr./Licence no:",null,null,null,"Resultat  Résultat",null,"Kontrolle"]
[null,{"$f":"Start!L16","v":""},null,null,{"$f":"Start!N16","v":""},null,null,null,null,null,"Contrôle"]
[null,"Jg: Année",{"$f":"Start!M16","v":""},{"$f":"IF(Start!J25=\"x\",\"Karton Nr. Carton-no\",\"Elektronisch életronique\")","v":"Elektronisch életronique"},{"$f":"G11+1","v":8},"-",{"$f":"IF(Start!J25=\"x\",'3. Runde'!E15:E16+3,E15)","v":8},null,{"$f":"SUM(H13:H16)","v":0}]
[]
[null,"Name, Nom:",null,{"$f":"IF(Start!O17=\"x\",\"ausgewechselt\", \" \")","v":" "},"Lizenz Nr./Licence no:",null,null,null,"Resultat  Résultat",null,"Kontrolle"]
[null,{"$f":"Start!L17","v":0},null,null,{"$f":"Start!N17","v":0},null,null,null,null,null,"Contrôle"]
[null,"Jg: Année",{"$f":"Start!M17","v":0},{"$f":"IF(Start!J25=\"x\",\"Karton Nr. Carton-no\",\"Elektronisch életronique\")","v":"Elektronisch életronique"},null,"-",null,null,{"$f":"SUM(H17:H20)","v":0}]
[]
["Die aufgeführten Schützen sind lizenzierte Mitglieder unseres Vereins. Sie haben Vorschrifts- gemäss geschossen.  Les tireurs inscripts sont membres licenciés de notre société. Ils ont tiré confoormément aux prescriptions.",null,null,null,null,null,null,"Total",{"$f":"SUM(I7+I11+I15+I19)","v":0}]
[]
["Der Kontrolleur / Le Contrôleur:"]
[]
["Gruppenmeisterschaft SSV Gewehr 10m\nChampionnant de groupes SSV carabine 10m",null,null,null,null,null,null,null,null,null,{"$f":"K1","v":"Junioren /\nJuniors U10-U17"}]
["Verein: Sociéte:",{"$f":"B2","v":0},null,null,null,null,"Vereinsnummer: Société No:",null,{"$f":"I2","v":0},"Runde: Tour:",{"$f":"K2","v":3}]
["Funktionär: Responsable:",null,{"$f":"C3","v":0},null,null,null,"Tel. / Tél:",{"$f":"H3","v":0},null,"Gruppe:Groupe:",{"$f":"K3","v":0}]
["Strasse, PLZ, Ort: rue, NPA, lieu:",null,{"$f":"C4","v":0},null,{"$f":"E4","v":0},null,null,{"$f":"H4","v":"E-Mail:"},{"$f":"I4","v":0}]
[1,"Name, Nom:",null,{"$f":"D5","v":" "},"Lizenz Nr./Licence no:",null,null,{"$f":"H5","v":0},"Resultat  Résultat",null,"Kontrolle"]
[null,{"$f":"B6","v":""},null,null,{"$f":"E6","v":""},null,null,{"$f":"H6","v":0},null,null,"Contrôle"]
[null,"Jg: Année",{"$f":"C7","v":""},{"$f":"D7","v":"Elektronisch életronique"},{"$f":"E7","v":6},"-",{"$f":"G7","v":6},0,{"$f":"I7","v":0}]
[null,null,null,null,null,null,null,0]
[2,"Name, Nom:",null,{"$f":"D9","v":" "},"Lizenz Nr./Licence no:",null,null,0,"Resultat  Résultat",null,"Kontrolle"]
[null,{"$f":"B10","v":""},null,null,{"$f":"E10","v":""},null,null,0,null,null,"Contrôle"]
[null,"Jg: Année",{"$f":"C11","v":""},{"$f":"D11","v":"Elektronisch életronique"},{"$f":"E11","v":7},"-",{"$f":"G11","v":7},0,{"$f":"I11","v":0}]
[null,null,null,null,null,null,null,0]
[3,"Name, Nom:",null,{"$f":"D13","v":" "},"Lizenz Nr./Licence no:",null,null,0,"Resultat  Résultat",null,"Kontrolle"]
[null,{"$f":"B14","v":""},null,null,{"$f":"E14","v":""},null,null,0,null,null,"Contrôle"]
[null,"Jg: Année",{"$f":"C15","v":""},{"$f":"D15","v":"Elektronisch életronique"},{"$f":"E15","v":8},"-",{"$f":"G15","v":8},0,{"$f":"I15","v":0}]
[null,null,null,null,null,null,null,0]
[null,"Name, Nom:",null,{"$f":"D17","v":" "},"Lizenz Nr./Licence no:",null,null,0,"Resultat  Résultat",null,"Kontrolle"]
[null,{"$f":"B18","v":0},null,null,{"$f":"E18","v":0},null,null,0,null,null,"Contrôle"]
[null,"Jg: Année",{"$f":"C19","v":0},{"$f":"D19","v":"Elektronisch életronique"},null,"-",null,0,{"$f":"I19","v":0}]
[null,null,null,null,null,null,null,0]
["Die aufgeführten Schützen sind lizenzierte Mitglieder unseres Vereins. Sie haben Vorschrifts- gemäss geschossen.  Les tireurs inscripts sont membres licenciés de notre société. Ils ont tiré confoormément aux prescriptions.",null,null,null,null,null,null,"Total",{"$f":"I21","v":0}]
[]
["Der Kontrolleur / Le Contrôleur:",null,null,null,{"$f":"E23","v":0}]
["Gruppenmeisterschaft SSV Gewehr 10m\nChampionnant de groupes SSV carabine 10m",null,null,null,null,null,null,null,null,null,{"$f":"K25","v":"Junioren /\nJuniors U10-U17"}]
["Verein: Sociéte:",{"$f":"B26","v":0},null,null,null,null,"Vereinsnummer: Société No:",null,{"$f":"I26","v":0},"Runde: Tour:",{"$f":"K26","v":3}]
["Funktionär: Responsable:",null,{"$f":"C27","v":0},null,null,null,"Tel. / Tél:",{"$f":"H27","v":0},null,"Gruppe:Groupe:",{"$f":"K27","v":0}]
["Strasse, PLZ, Ort: rue, NPA, lieu:",null,{"$f":"C28","v":0},null,{"$f":"E28","v":0},null,null,{"$f":"H28","v":"E-Mail:"},{"$f":"I28","v":0}]
[1,"Name, Nom:",null,{"$f":"D29","v":" "},"Lizenz Nr./Licence no:",null,null,{"$f":"H29","v":0},"Resultat  Résultat",null,"Kontrolle"]
[null,{"$f":"B30","v":""},null,null,{"$f":"E30","v":""},null,null,{"$f":"H30","v":0},null,null,"Contrôle"]
[null,"Jg: Année",{"$f":"C31","v":""},{"$f":"D31","v":"Elektronisch életronique"},{"$f":"E31","v":6},"-",{"$f":"G31","v":6},0,{"$f":"I31","v":0}]
[null,null,null,null,null,null,null,0]
[2,"Name, Nom:",null,{"$f":"D33","v":" "},"Lizenz Nr./Licence no:",null,null,0,"Resultat  Résultat",null,"Kontrolle"]
[null,{"$f":"B34","v":""},null,null,{"$f":"E34","v":""},null,null,0,null,null,"Contrôle"]
[null,"Jg: Année",{"$f":"C35","v":""},{"$f":"D35","v":"Elektronisch életronique"},{"$f":"E35","v":7},"-",{"$f":"G35","v":7},0,{"$f":"I35","v":0}]
[null,null,null,null,null,null,null,0]
[3,"Name, Nom:",null,{"$f":"D37","v":" "},"Lizenz Nr./Licence no:",null,null,0,"Resultat  Résultat",null,"Kontrolle"]
[null,{"$f":"B38","v":""},null,null,{"$f":"E38","v":""},null,null,0,null,null,"Contrôle"]
[null,"Jg: Année",{"$f":"C39","v":""},{"$f":"D39","v":"Elektronisch életronique"},{"$f":"E39","v":8},"-",{"$f":"G39","v":8},0,{"$f":"I39","v":0}]
[null,null,null,null,null,null,null,0]
[null,"Name, Nom:",null,{"$f":"D41","v":" "},"Lizenz Nr./Licence no:",null,null,0,"Resultat  Résultat",null,"Kontrolle"]
[null,{"$f":"B42","v":0},null,null,{"$f":"E42","v":0},null,null,0,null,null,"Contrôle"]
[null,"Jg: Année",{"$f":"C43","v":0},{"$f":"D43","v":"Elektronisch életronique"},null,"-",null,0,{"$f":"I43","v":0}]
[null,null,null,null,null,null,null,0]
["Die aufgeführten Schützen sind lizenzierte Mitglieder unseres Vereins. Sie haben Vorschrifts- gemäss geschossen.  Les tireurs inscripts sont membres licenciés de notre société. Ils ont tiré confoormément aux prescriptions.",null,null,null,null,null,null,"Total",{"$f":"I45","v":0}]
[]
["Der Kontrolleur / Le Contrôleur:",null,null,null,{"$f":"E47","v":0}]